1-(vinyloxy)propane
- Formula: C5H10O
- Molecular weight: 86.1323
- IUPAC Standard InChIKey: OVGRCEFMXPHEBL-UHFFFAOYSA-N
- CAS Registry Number: 764-47-6
- Chemical structure:
View 3d structure (requires JavaScript / HTML 5) - Other names: Propoxyethylene

Gas phase thermochemistry data

Data compiled by: Donald R. Burgess, Jr.
Quantity | Value | Units | Method | Reference | Comment |
---|---|---|---|---|---|
ΔfH°gas | -162.0 ± 2.2 | kJ/mol | N/A | Trofimov, Nedolya, et al., 1981 | Value computed using ΔfHliquid° value of -191±0.8 kj/mol from Trofimov, Nedolya, et al., 1981 and ΔvapH° value of 29±2 kj/mol from missing citation. |

Condensed phase thermochemistry data

Data compiled by: Hussein Y. Afeefy, Joel F. Liebman, and Stephen E. Stein
Quantity | Value | Units | Method | Reference | Comment |
---|---|---|---|---|---|
ΔfH°liquid | -191. ± 0.8 | kJ/mol | Ccb | Trofimov, Nedolya, et al., 1981 | |
Quantity | Value | Units | Method | Reference | Comment |
ΔcH°liquid | -3206. ± 0.8 | kJ/mol | Ccb | Trofimov, Nedolya, et al., 1981 | Corresponding ΔfHºliquid = -191. kJ/mol (simple calculation by NIST; no Washburn corrections) |
ΔcH°liquid | -3202. ± 9.2 | kJ/mol | Ccb | Favorskii and Shostakovskii, 1943 | Corresponding ΔfHºliquid = -195. kJ/mol (simple calculation by NIST; no Washburn corrections) |

Phase change data

Data compiled by: Hussein Y. Afeefy, Joel F. Liebman, and Stephen E. Stein
Quantity | Value | Units | Method | Reference | Comment |
---|---|---|---|---|---|
ΔvapH° | 29. ± 2. | kJ/mol | V | Trofimov, Nedolya, et al., 1981 |

References

Trofimov, Nedolya, et al., 1981
Trofimov, B.A.; Nedolya, N.A.; Lebedeva, N.D.; Ryadchenko, V.L.; Masalitionova, T.N.; Dobichin, S.L.; Zacheslavskaya, R.Kh.; Petrov, G.N.,
Thermochemical and quantochemical estimationof the conjungation energy of vinyl ethers.,
Izv. Akad. Nauk SSSR, Ser. Khim., 1981, 30, 752-753. [all data]
Favorskii and Shostakovskii, 1943
Favorskii, A.E.; Shostakovskii, M.F.,
Vinyl ethers. I. Synthesis and properties of vinyl ethers,
Zh. Obshch. Kim., 1943, 13, 1-20. [all data]