2-Butene, 1,4-dichloro-
- Formula: C4H6Cl2
- Molecular weight: 124.996
- IUPAC Standard InChIKey: FQDIANVAWVHZIR-UHFFFAOYSA-N
- CAS Registry Number: 764-41-0
- Chemical structure:
View 3d structure (requires JavaScript / HTML 5) - Stereoisomers:
- Other names: 1,4-Dichloro-2-butene; Dichlorobutene; DCB; 1,4-DCB; 1,4-Dichlorobutene-2; Rcra waste number U074; 1,4-Dichloro-2-but-2-ene; 1,4-dichlorobut-2-ene

Phase change data

Data compiled by: Robert L. Brown and Stephen E. Stein
Reduced pressure boiling point
Tboil (K) | Pressure (bar) | Reference |
---|---|---|
346.7 | 0.053 | Aldrich Chemical Company Inc., 1990 |
345. | 0.053 | Farchan Laboratories, 1990 |

Van Den Dool and Kratz RI, non-polar column, temperature ramp

Column type | Active phase | I | Reference | Comment |
---|---|---|---|---|
Capillary | DB-1 | 864.6 | Sun and Stremple, 2003 | 30. m/0.25 mm/0.25 μm, He, 3. K/min; Tstart: 40. C; Tend: 325. C |

References

Aldrich Chemical Company Inc., 1990
Aldrich Chemical Company Inc.,
Catalog Handbook of Fine Chemicals, Aldrich Chemical Company, Inc., Milwaukee WI, 1990, 1. [all data]
Farchan Laboratories, 1990
Farchan Laboratories,
Research Chemicals Catalog, Farchan Laboratories, Gainesville, FL, 1990, 91. [all data]
Sun and Stremple, 2003
Sun, G.; Stremple, P.,
Retention index characterization of flavor, fragrance, and many other compounds on DB-1 and DB-XLB, 2003, retrieved from http://www.chem.agilent.com/cag/cabu/pdf/b-0279.pdf. [all data]