2,4,4,5,5,7-hexamethyloctane
- Formula: C14H30
- Molecular weight: 198.3880
- IUPAC Standard InChIKey: XUTWOXGTLRFHDJ-UHFFFAOYSA-N
- CAS Registry Number: 76426-52-3
- Chemical structure:
View 3d structure (requires JavaScript / HTML 5) - Permanent link for this species. Use this link for bookmarking this species for future reference.

Phase change data

Data compiled by: Thermodynamics Research Center, NIST Boulder Laboratories, Chris Muzny director
Quantity | Value | Units | Method | Reference | Comment |
---|---|---|---|---|---|
Tboil | 490. | K | N/A | Petrov, Sushchinskii, et al., 1957 | Uncertainty assigned by TRC = 4. K |

References

Petrov, Sushchinskii, et al., 1957
Petrov, A.D.; Sushchinskii, V.L.; Zakharov, E.P.; Rogozhnikova, T.I.,
Synthesis of Branched ALiphatic C10-C15 Hydrocarbons by the Grignard and the Grignard-Wurtz Reactions,
Zh. Obshch. Khim., 1957, 27, 467. [all data]