(Z)-3-Heptene
- Formula: C7H14
- Molecular weight: 98.1861
- IUPAC Standard InChIKey: WZHKDGJSXCTSCK-ALCCZGGFSA-N
- CAS Registry Number: 7642-10-6
- Chemical structure:
View 3d structure (requires JavaScript / HTML 5) - Stereoisomers:
- Other names: cis-3-Heptene; 3-Heptene, (Z)-

Gas phase thermochemistry data

Data compiled by: Donald R. Burgess, Jr.
Quantity | Value | Units | Method | Reference | Comment |
---|---|---|---|---|---|
ΔfH°gas | -69.4 | kJ/mol | N/A | Wiberg, Wasserman, et al., 1984 | Value computed using ΔfHliquid° value of -104.6±0.63 kj/mol from Wiberg, Wasserman, et al., 1984 and ΔvapH° value of 35.2 kj/mol from alkenes correlation. |
ΔfH°gas | -68.8 ± 0.6 | kJ/mol | Eqk | Wiberg, Wasserman, et al., 1984 | Value computed using ΔfHliquid° from Wiberg, Wasserman, et al., 1984 and ΔvapH° value of 35.8 kJ/mol from Steele and Chirico, 1993. |
ΔfH°gas | -69.1 | kJ/mol | N/A | Good, 1976 | Value computed using ΔfHliquid° value of -104.3±0.79 kj/mol from Good, 1976 and ΔvapH° value of 35.2 kj/mol from alkenes correlation. |
ΔfH°gas | -68.5 ± 0.8 | kJ/mol | Ccb | Good, 1976 | Value computed using ΔfHliquid° from Good, 1976 and ΔvapH° value of 35.8 kJ/mol from Steele and Chirico, 1993. |

Condensed phase thermochemistry data

Data compiled by: Hussein Y. Afeefy, Joel F. Liebman, and Stephen E. Stein
Quantity | Value | Units | Method | Reference | Comment |
---|---|---|---|---|---|
ΔfH°liquid | -104.6 ± 0.63 | kJ/mol | Eqk | Wiberg, Wasserman, et al., 1984 | Trifluoroacetolysis, hrxn[kcal/mol]=-10.14±0.03 |
ΔfH°liquid | -104.3 ± 0.79 | kJ/mol | Ccb | Good, 1976 |

Phase change data

Data compiled as indicated in comments:
BS - Robert L. Brown and Stephen E. Stein
TRC - Thermodynamics Research Center, NIST Boulder Laboratories, Chris Muzny director
AC - William E. Acree, Jr., James S. Chickos
Quantity | Value | Units | Method | Reference | Comment |
---|---|---|---|---|---|
Tboil | 369.0 | K | N/A | Weast and Grasselli, 1989 | BS |
Tboil | 368.9 | K | N/A | Anonymous, 1951 | Uncertainty assigned by TRC = 0.3 K; TRC |
Tboil | 368.97 | K | N/A | Shepherd, Greenlee, et al., 1948 | Uncertainty assigned by TRC = 0.3 K; TRC |
Tboil | 369.1 | K | N/A | Soday and Boord, 1933 | Uncertainty assigned by TRC = 0.5 K; TRC |
Tboil | 369.15 | K | N/A | Vavon and Kleiner, 1923 | Uncertainty assigned by TRC = 1. K; TRC |
Quantity | Value | Units | Method | Reference | Comment |
ΔvapH° | 35.6 | kJ/mol | N/A | Reid, 1972 | AC |
Enthalpy of vaporization
ΔvapH (kJ/mol) | Temperature (K) | Method | Reference | Comment |
---|---|---|---|---|
35.0 | 327. | A | Stephenson and Malanowski, 1987 | Based on data from 312. to 369. K.; AC |

Reaction thermochemistry data

Data compiled by: Hussein Y. Afeefy, Joel F. Liebman, and Stephen E. Stein
Individual Reactions
By formula: H2 + C7H14 = C7H16
Quantity | Value | Units | Method | Reference | Comment |
---|---|---|---|---|---|
ΔrH° | -118.5 ± 0.3 | kJ/mol | Chyd | Rogers and Dejroongruang, 1988 | liquid phase; solvent: Hydrocarbone |
ΔrH° | -117.2 ± 2.8 | kJ/mol | Chyd | Rogers and Siddiqui, 1975 | liquid phase; solvent: n-Hexane |
By formula: C7H14 = C7H14
Quantity | Value | Units | Method | Reference | Comment |
---|---|---|---|---|---|
ΔrH° | -7.6 ± 1.1 | kJ/mol | Eqk | Kabo, Andreevskii, et al., 1967 | gas phase; Heat of isomerization |

Kovats' RI, non-polar column, isothermal

Data compiled by: NIST Mass Spectrometry Data Center, William E. Wallace, director

Column type CapillaryCapillaryCapillaryCapillaryCapillary
Active phase Methyl SiliconeSqualaneSqualaneOV-101OV-101
Column length (m) 150.93.
Carrier gas HeHe
Substrate
Column diameter (mm) 0.2500.250
Phase thickness (μm)
Temperature (C) 30.30.100.40.60.
I 701.1689.6692.696.696.
ReferenceSoják, Addová, et al., 2002Soják, Addová, et al., 2002Heinzen, Soares, et al., 1999Laub and Purnell, 1988Laub and Purnell, 1988
Comment MSDC-RI MSDC-RI MSDC-RI MSDC-RI MSDC-RI
Column type CapillaryCapillaryCapillaryCapillaryCapillary
Active phase OV-101OV-101OV-101SqualaneSqualane
Column length (m)  100.100.100.100.
Carrier gas  N2N2N2N2
Substrate
Column diameter (mm)  0.270.270.250.25
Phase thickness (μm)  0.90.9
Temperature (C) 80.50.70.50.70.
I 697.696.1696.9690.5691.1
ReferenceLaub and Purnell, 1988Boneva and Dimov, 1986Boneva and Dimov, 1986Boneva and Dimov, 1986Boneva and Dimov, 1986
Comment MSDC-RI MSDC-RI MSDC-RI MSDC-RI MSDC-RI
Column type CapillaryCapillaryCapillaryCapillaryCapillary
Active phase DB-1HP-PONASqualaneSqualaneSqualane
Column length (m) 60.50.100.100.100.
Carrier gas H2H2N2N2
Substrate
Column diameter (mm) 0.2640.210.250.250.25
Phase thickness (μm) 0.250.5
Temperature (C) 40.40.50.50.50.
I 701.701.690.691.690.4
ReferenceLubeck and Sutton, 1984Lubeck and Sutton, 1984Mitra, 1981Mitra, 1981Bajus, Veselý, et al., 1979
Comment MSDC-RI MSDC-RI MSDC-RI MSDC-RI MSDC-RI
Column type CapillaryCapillaryCapillaryCapillaryCapillary
Active phase SqualaneSqualaneSqualaneSqualaneSqualane
Column length (m) 100.120.120.120.120.
Carrier gas  HeHeHeHe
Substrate
Column diameter (mm) 0.250.250.250.250.25
Phase thickness (μm)
Temperature (C) 70.100.100.100.55.
I 691.1694.1695.3697.3697.3
ReferenceBajus, Veselý, et al., 1979Lulova, Leont'eva, et al., 1976Lulova, Leont'eva, et al., 1976Lulova, Leont'eva, et al., 1976Lulova, Leont'eva, et al., 1975
Comment MSDC-RI MSDC-RI MSDC-RI MSDC-RI MSDC-RI
Column type CapillaryCapillaryCapillaryCapillaryCapillary
Active phase SqualaneSqualaneSqualaneSqualaneSqualane
Column length (m) 100.100.
Carrier gas N2N2
Substrate
Column diameter (mm) 0.250.25
Phase thickness (μm)
Temperature (C) 50.70.100.115.86.
I 690.691.692.692.692.
ReferenceRijks and Cramers, 1974Rijks and Cramers, 1974Sojak, Hrivnak, et al., 1973Sojak, Hrivnak, et al., 1973Sojak, Hrivnak, et al., 1973
Comment MSDC-RI MSDC-RI MSDC-RI MSDC-RI MSDC-RI
Column type CapillaryCapillaryCapillaryCapillaryCapillary
Active phase Apiezon LSqualaneSqualaneSqualaneSqualane
Column length (m) 45.80.80.200.200.
Carrier gas    N2N2
Substrate
Column diameter (mm) 0.250.250.250.20.2
Phase thickness (μm)
Temperature (C) 100.60.60.115.86.
I 697.4690.9691.692.3691.7
ReferenceEisen, Orav, et al., 1972Eisen, Orav, et al., 1972Orav and Eisen, 1972Soják and Bucinská, 1970Soják and Bucinská, 1970
Comment MSDC-RI MSDC-RI MSDC-RI MSDC-RI MSDC-RI
Column type CapillaryPackedPackedPackedPacked
Active phase SqualaneSqualaneSqualaneSqualaneSqualane
Column length (m) 91.415.15.15.15.
Carrier gas N2HeHeHeHe
Substrate  Chromosorb PChromosorb PChromosorb PChromosorb P
Column diameter (mm) 0.250.250.250.250.25
Phase thickness (μm)
Temperature (C) 40.27.49.67.86.
I 690.690.691.692.692.
ReferenceMatukuma, 1969Hively and Hinton, 1968Hively and Hinton, 1968Hively and Hinton, 1968Hively and Hinton, 1968
Comment MSDC-RI MSDC-RI MSDC-RI MSDC-RI MSDC-RI

Normal alkane RI, non-polar column, temperature ramp

Data compiled by: NIST Mass Spectrometry Data Center, William E. Wallace, director

Column type CapillaryCapillaryCapillaryCapillaryCapillary
Active phase Polydimethyl siloxane: CP-Sil 5 CBPetrocol DHPONAOV-101SE-54
Column length (m) 60.100.50.50.50.
Carrier gas HeliumHeliumNitrogenHelium
Substrate
Column diameter (mm) 0.250.250.200.200.32
Phase thickness (μm) 1.00.500.500.50
Tstart (C) 45.20.35.30.60.
Tend (C) 210.220.200.100.200.
Heat rate (K/min) 3.615.2.1.4.
Initial hold (min) 1.4515.15.6.2.
Final hold (min) 2.7230.10.
I 702.701.702.697.701.
ReferenceBramston-Cook, 2013Supelco, 2012Zhang, Ding, et al., 2009Orav, Kailas, et al., 1999Guan, Li, et al., 1995
Comment MSDC-RI MSDC-RI MSDC-RI MSDC-RI MSDC-RI
Column type Capillary
Active phase DB-1
Column length (m) 50.
Carrier gas He
Substrate
Column diameter (mm) 0.32
Phase thickness (μm) 1.0
Tstart (C) -20.
Tend (C)
Heat rate (K/min) 2.
Initial hold (min)
Final hold (min)
I 701.
ReferenceRamnas, Ostermark, et al., 1994
Comment MSDC-RI

Normal alkane RI, non-polar column, isothermal

Data compiled by: NIST Mass Spectrometry Data Center, William E. Wallace, director

Column type Capillary
Active phase Squalane
Column length (m) 93.
Carrier gas He
Substrate
Column diameter (mm) 0.25
Phase thickness (μm)
Temperature (C) 40.
I 690.3
ReferenceSojak, Addova, et al., 2000
Comment MSDC-RI

References

Wiberg, Wasserman, et al., 1984
Wiberg, K.B.; Wasserman, D.J.; Martin, E.,
Enthalpies of hydration of alkenes. 2. The n-heptenes and n-pentenes,
J. Phys. Chem., 1984, 88, 3684-3688. [all data]
Steele and Chirico, 1993
Steele, W.V.; Chirico, R.D.,
Thermodynamic properties of alkenes (mono-olefins larger than C4),
J. Phys. Chem. Ref. Data, 1993, 22, 377-430. [all data]
Good, 1976
Good, W.D.,
The enthalpies of formation of five isomeric heptenes,
J. Chem. Thermodyn., 1976, 8, 67-71. [all data]
Weast and Grasselli, 1989
CRC Handbook of Data on Organic Compounds, 2nd Editon, Weast,R.C and Grasselli, J.G., ed(s)., CRC Press, Inc., Boca Raton, FL, 1989, 1. [all data]
Anonymous, 1951
Anonymous, R.,
, Sunbury Rep. No. 4199, Anglo-Iranian Oil Co., 1951. [all data]
Shepherd, Greenlee, et al., 1948
Shepherd; Greenlee, K.W.; Boord, C.E.,
, Am. Pet. Inst. Res. Proj. 45, 1948. [all data]
Soday and Boord, 1933
Soday, F.J.; Boord, C.E.,
Synthesis in the Olefin Series IV. The Heptenes,
J. Am. Chem. Soc., 1933, 55, 3293. [all data]
Vavon and Kleiner, 1923
Vavon, G.; Kleiner, S.,
C. R. Hebd. Seances Acad. Sci., 1923, 177, 401. [all data]
Reid, 1972
Reid, Robert C.,
Handbook on vapor pressure and heats of vaporization of hydrocarbons and related compounds, R. C. Wilhort and B. J. Zwolinski, Texas A Research Foundation. College Station, Texas(1971). 329 pages.$10.00,
AIChE J., 1972, 18, 6, 1278-1278, https://doi.org/10.1002/aic.690180637
. [all data]
Stephenson and Malanowski, 1987
Stephenson, Richard M.; Malanowski, Stanislaw,
Handbook of the Thermodynamics of Organic Compounds, 1987, https://doi.org/10.1007/978-94-009-3173-2
. [all data]
Rogers and Dejroongruang, 1988
Rogers, D.W.; Dejroongruang, K.,
Enthalpies of hydrogenation of the n-heptenes and the methylhexenes,
J. Chem. Thermodyn., 1988, 20, 675-680. [all data]
Rogers and Siddiqui, 1975
Rogers, D.W.; Siddiqui, N.A.,
Heats of hydrogenation of large molecules. I. Esters of unsaturated fatty acids,
J. Phys. Chem., 1975, 79, 574-577. [all data]
Kabo, Andreevskii, et al., 1967
Kabo, G.Ya.; Andreevskii, D.N.; Savinetskaya, G.A.,
Isomerization equilibrium of n-monochloroheptanes and n-heptenes,
Neftekhimiya, 1967, 7, 364-368. [all data]