2-Butyn-1-ol
- Formula: C4H6O
- Molecular weight: 70.0898
- IUPAC Standard InChIKey: NEEDEQSZOUAJMU-UHFFFAOYSA-N
- CAS Registry Number: 764-01-2
- Chemical structure:
View 3d structure (requires JavaScript / HTML 5) - Other names: But-2-yn-1-ol; 2-Butynol; 2-Butynyl alcohol; CH3C≡CCH2OH; 2-Butyne-1-ol

Phase change data

Data compiled as indicated in comments:
BS - Robert L. Brown and Stephen E. Stein
TRC - Thermodynamics Research Center, NIST Boulder Laboratories, Chris Muzny director
Quantity | Value | Units | Method | Reference | Comment |
---|---|---|---|---|---|
Tboil | 415.7 | K | N/A | Aldrich Chemical Company Inc., 1990 | BS |
Tboil | 415. | K | N/A | Farchan Laboratories, 1990 | BS |
Tboil | 414. | K | N/A | Hatch and Chiola, 1951 | Uncertainty assigned by TRC = 2. K; TRC |
Reduced pressure boiling point
Tboil (K) | Pressure (bar) | Reference | Comment |
---|---|---|---|
362. | 0.133 | Farchan Laboratories, 1990 | BS |
325.7 | 0.019 | Weast and Grasselli, 1989 | BS |

Normal alkane RI, non-polar column, custom temperature program

Column type | Active phase | I | Reference | Comment |
---|---|---|---|---|
Capillary | Methyl Silicone | 695. | Zenkevich, 1996 | Program: not specified |

References

Aldrich Chemical Company Inc., 1990
Aldrich Chemical Company Inc.,
Catalog Handbook of Fine Chemicals, Aldrich Chemical Company, Inc., Milwaukee WI, 1990, 1. [all data]
Farchan Laboratories, 1990
Farchan Laboratories,
Research Chemicals Catalog, Farchan Laboratories, Gainesville, FL, 1990, 91. [all data]
Hatch and Chiola, 1951
Hatch, L.F.; Chiola, V.,
The preparation and properties of 3-chloro-1-propyne and 1-chloro-2-butyne,
J. Am. Chem. Soc., 1951, 73, 360. [all data]
Weast and Grasselli, 1989
CRC Handbook of Data on Organic Compounds, 2nd Editon, Weast,R.C and Grasselli, J.G., ed(s)., CRC Press, Inc., Boca Raton, FL, 1989, 1. [all data]