1-Propanol, 2-methyl-2-nitro-
- Formula: C4H9NO3
- Molecular weight: 119.1192
- IUPAC Standard InChIKey: MVGJRISPEUZYAQ-UHFFFAOYSA-N
- CAS Registry Number: 76-39-1
- Chemical structure:

Condensed phase thermochemistry data

Data compiled by: Hussein Y. Afeefy, Joel F. Liebman, and Stephen E. Stein
Quantity | Value | Units | Method | Reference | Comment |
---|---|---|---|---|---|
ΔfH°solid | -98.05 ± 0.40 | kcal/mol | Ccb | Currie, Bennett, et al., 1952 | |
ΔfH°solid | -98.05 ± 0.40 | kcal/mol | Ccb | Currie, 1950 | |
Quantity | Value | Units | Method | Reference | Comment |
ΔcH°solid | -585.59 ± 0.40 | kcal/mol | Ccb | Currie, Bennett, et al., 1952 | |
ΔcH°solid | -585.59 ± 0.40 | kcal/mol | Ccb | Currie, 1950 |

Phase change data

Data compiled as indicated in comments:
BS - Robert L. Brown and Stephen E. Stein
TRC - Thermodynamics Research Center, NIST Boulder Laboratories, Chris Muzny director
AC - William E. Acree, Jr., James S. Chickos
CAL - James S. Chickos, William E. Acree, Jr., Joel F. Liebman, Students of Chem 202 (Introduction to the Literature of Chemistry), University of Missouri -- St. Louis
DH - Eugene S. Domalski and Elizabeth D. Hearing
Quantity | Value | Units | Method | Reference | Comment |
---|---|---|---|---|---|
Tfus | 361.7 | K | N/A | Murrill and Breed, 1970 | Crystal phase 1 phase; Uncertainty assigned by TRC = 2. K; TRC |
Reduced pressure boiling point
Tboil (K) | Pressure (atm) | Reference | Comment |
---|---|---|---|
367.7 | 0.013 | Weast and Grasselli, 1989 | BS |
Enthalpy of fusion
ΔfusH (kcal/mol) | Temperature (K) | Reference | Comment |
---|---|---|---|
0.758 | 363.9 | Salud, López, et al., 1999 | AC |
0.894 | 361. | Domalski and Hearing, 1996 | AC |
Entropy of fusion
ΔfusS (cal/mol*K) | Temperature (K) | Reference | Comment |
---|---|---|---|
13.26 | 310. | Domalski and Hearing, 1996 | CAL |
2.474 | 361. |
Enthalpy of phase transition
ΔHtrs (kcal/mol) | Temperature (K) | Initial Phase | Final Phase | Reference | Comment |
---|---|---|---|---|---|
4.1097 | 310. | crystaline, II | crystaline, I | Murrill and Breed, 1970, 2 | DH |
0.8934 | 361. | crystaline, I | liquid | Murrill and Breed, 1970, 2 | DH |
Entropy of phase transition
ΔStrs (cal/mol*K) | Temperature (K) | Initial Phase | Final Phase | Reference | Comment |
---|---|---|---|---|---|
13.3 | 310. | crystaline, II | crystaline, I | Murrill and Breed, 1970, 2 | DH |
2.51 | 361. | crystaline, I | liquid | Murrill and Breed, 1970, 2 | DH |

Kovats' RI, polar column, isothermal

Column type | Active phase | Temperature (C) | I | Reference | Comment |
---|---|---|---|---|---|
Capillary | Carbowax 20M | 413. | 1898. | Boneva and Dimov, 1982 | N2; Column length: 24. m |

References

Currie, Bennett, et al., 1952
Currie, R.M.; Bennett, C.O.; Holcomb, D.E.,
Heats of combustion of some nitro alcohols,
Ind. Eng. Chem., 1952, 44, 329-331. [all data]
Currie, 1950
Currie, R.M.,
Heats of combustion of some nitroalcohols, Thesis for Purdue University, 1950, 1-84. [all data]
Murrill and Breed, 1970
Murrill, E.; Breed, L.W.,
Solid-solid phase transitions determined by differential scanning calorime- try. Part I. Tetrahedral Substances.,
Thermochim. Acta, 1970, 1, 239. [all data]
Weast and Grasselli, 1989
CRC Handbook of Data on Organic Compounds, 2nd Editon, Weast,R.C and Grasselli, J.G., ed(s)., CRC Press, Inc., Boca Raton, FL, 1989, 1. [all data]
Salud, López, et al., 1999
Salud, Josep; López, David O.; Barrio, Maria; Tamarit, Josep Ll.,
Two-component systems of isomorphous orientationally disordered crystals. Part 1 Packing of the mixed crystals,
J. Mater. Chem., 1999, 9, 4, 909-916, https://doi.org/10.1039/a808258h
. [all data]
Domalski and Hearing, 1996
Domalski, Eugene S.; Hearing, Elizabeth D.,
Heat Capacities and Entropies of Organic Compounds in the Condensed Phase. Volume III,
J. Phys. Chem. Ref. Data, 1996, 25, 1, 1, https://doi.org/10.1063/1.555985
. [all data]
Murrill and Breed, 1970, 2
Murrill, E.; Breed, L.,
Solid-solid phase transitions determined by differential scanning calorimetry,
Thermochim. Acta, 1970, 1, 239-246. [all data]
Lipczynska-Kochany and Urbanski, 1977
Lipczynska-Kochany, E.; Urbanski, T.,
Can. J. Chem., 1977, 55, 2504. [all data]
Boneva and Dimov, 1982
Boneva, S.; Dimov, N.,
Note. Glass capillary gas chromatography of C2-C5 2-nitro-1-alkanols,
J. Chromatogr., 1982, 240, 1, 215-217, https://doi.org/10.1016/S0021-9673(01)84026-7
. [all data]