2,2,3-trichlorobutyraldehyde
- Formula: C4H5Cl3O
- Molecular weight: 175.441
- IUPAC Standard InChIKey: OXVISHZELPRKFQ-UHFFFAOYSA-N
- CAS Registry Number: 76-36-8
- Chemical structure:
View 3d structure (requires JavaScript / HTML 5) - Other names: 2,2,3-Trichlorobutanal

Condensed phase thermochemistry data

Data compiled by: Eugene S. Domalski and Elizabeth D. Hearing
Constant pressure heat capacity of liquid
Cp,liquid (J/mol*K) | Temperature (K) | Reference | Comment |
---|---|---|---|
241.8 | 298. | von Reis, 1881 | T = 291 to 457 K. |

References

von Reis, 1881
von Reis, M.A.,
Die specifische Wärme flüssiger organischer Verbindungen und ihre Beziehung zu deren Moleculargewicht,
Ann. Physik [3], 1881, 13, 447-464. [all data]