1-Hexadecanol, TBDMS derivative
- Formula: C22H48OSi
- Molecular weight: 356.7014
- IUPAC Standard InChIKey: GEBXGUYDPCUQFM-UHFFFAOYSA-N
- CAS Registry Number: 76358-80-0
- Chemical structure:
View 3d structure (requires JavaScript / HTML 5) - Other names: Silane, (1,1-dimethylethyl)(hexadecyloxy)dimethyl-; Hexadecyl tert-butyldimethylsilyl ether; 1-Hexadecanol, DMTBS; 1-Hexadecanol, O-TBDMS; 1-Hexadecanol, tBDMS; tert-Butyldimethylsilyl hexadecyl ether

Van Den Dool and Kratz RI, non-polar column, temperature ramp

Column type | Active phase | I | Reference | Comment |
---|---|---|---|---|
Capillary | DB-1 | 2185. | Peng, 1992 | 15. m/0.53 mm/1. μm, 40. C @ 4. min, 8. K/min; Tend: 250. C |

Van Den Dool and Kratz RI, non-polar column, custom temperature program

Column type | Active phase | I | Reference | Comment |
---|---|---|---|---|
Capillary | VF-5MS | 2186.2 | Zheng and White, 2008 | 30. m/0.25 mm/0.25 μm, He; Program: not specified |
Capillary | Methyl Silicone | 2185. | Peng, Yang, et al., 1991 | Program: not specified |

Van Den Dool and Kratz RI, polar column, temperature ramp

Column type | Active phase | I | Reference | Comment |
---|---|---|---|---|
Capillary | Carbowax 20M | 2156. | Peng, 1992 | 8. K/min, 200. C @ 60. min; Column length: 3.05 m; Tstart: 40. C |
Packed | Carbowax 20M | 2159. | Peng, Yang, et al., 1991 | Supelcoport, 40. C @ 4. min, 8. K/min; Column length: 3.05 m; Tend: 200. C |

References

Peng, 1992
Peng, C.T.,
A method for tentative identificatoin of unknown gas chromatographic peaks by retention index,
J. Radioanal. Nucl. Chem., 1992, 160, 2, 449-460, https://doi.org/10.1007/BF02037120
. [all data]
Zheng and White, 2008
Zheng, Y.; White, E.,
Retention Data. NIST Mass Spectrometry Data Center., NIST Mass Spectrometry Data Center, 2008. [all data]
Peng, Yang, et al., 1991
Peng, C.T.; Yang, Z.C.; Maltby, D.,
Prediction of retention indexes. III. Silylated derivatives of polar compounds,
J. Chromatogr., 1991, 586, 1, 113-129, https://doi.org/10.1016/0021-9673(91)80029-G
. [all data]