N-(aminocarbonyl)-3-oxobutyramide
- IUPAC Standard InChIKey: XSTSHBWKUKSVEP-UHFFFAOYSA-N
- CAS Registry Number: 763-57-5
- Chemical structure:
View 3d structure (requires JavaScript / HTML 5) - Permanent link for this species. Use this link for bookmarking this species for future reference.

Reaction thermochemistry data

Data compiled by: Hussein Y. Afeefy, Joel F. Liebman, and Stephen E. Stein
Individual Reactions
By formula: CH4N2O + C4H4O2 = N-(aminocarbonyl)-3-oxobutyramide
Quantity | Value | Units | Method | Reference | Comment |
---|---|---|---|---|---|
ΔrH° | -106.4 | kJ/mol | Kin | Lopatin, Popov, et al., 1992 | liquid phase; solvent: Solution |

References

Lopatin, Popov, et al., 1992
Lopatin, E.B.; Popov, V.V.; Epshtein, N.A.; Mikhaleva, L.M.; Makarov, Yu.N.,
Kinetic and thermochemical characteristics of diketene-based reactions,
Khim.-Farm. Zh., 1992, 26, 76-78. [all data]