2,6-Dichlorosyringaldehyde

Phase change data

Data compiled by: William E. Acree, Jr., James S. Chickos

Enthalpy of vaporization

ΔvapH (kJ/mol) Temperature (K) Method Reference Comment
82.2308.CGCLei, Wania, et al., 1999Based on data from 293. - 323. K.

References

Lei, Wania, et al., 1999
Lei, Ying Duan; Wania, Frank; Shiu, Wan Ying; Boocock, David G.B., Temperature Dependent Vapor Pressures of Chlorinated Catechols, Syringols, and Syringaldehydes, J. Chem. Eng. Data, 1999, 44, 2, 200-202, https://doi.org/10.1021/je9801819 . [all data]