3-Oxabicyclo[3.2.1]octane-2,4-dione, 1,8,8-trimethyl-
- Formula: C10H14O3
- Molecular weight: 182.2164
- IUPAC Standard InChIKey: VFZDNKRDYPTSTP-UHFFFAOYSA-N
- CAS Registry Number: 76-32-4
- Chemical structure:
View 3d structure (requires JavaScript / HTML 5) - Species with the same structure:
- Other names: d-Camphoric anhydride; Camphoric anhydride; 1,3-Cyclopentanedicarboxylic anhydride, 1,2,2-trimethyl-; (dl)-camphoric anhydride

Phase change data

Data compiled as indicated in comments:
TRC - Thermodynamics Research Center, NIST Boulder Laboratories, Chris Muzny director
AC - William E. Acree, Jr., James S. Chickos
CAL - James S. Chickos, William E. Acree, Jr., Joel F. Liebman, Students of Chem 202 (Introduction to the Literature of Chemistry), University of Missouri -- St. Louis
Quantity | Value | Units | Method | Reference | Comment |
---|---|---|---|---|---|
Ttriple | 493.6 | K | N/A | Weinstein, Leffler, et al., 1984 | Crystal phase 1 phase; Uncertainty assigned by TRC = 1.5 K; TRC |
Enthalpy of fusion
ΔfusH (kJ/mol) | Temperature (K) | Method | Reference | Comment |
---|---|---|---|---|
5.72 | 493.9 | DSC | Weinstein, Leffler, et al., 1984, 2 | AC |
8.7 | 495. | DSC | Mjojo, 1979 | AC |
Entropy of fusion
ΔfusS (J/mol*K) | Temperature (K) | Reference | Comment |
---|---|---|---|
71.43 | 406. | Mjojo, 1979 | CAL |
17.58 | 495. |

References

Weinstein, Leffler, et al., 1984
Weinstein, D.I.; Leffler, A.J.; Currie, J.A.,
Phase Transitions in Bicyclic Compounds,
Mol. Cryst. Liq. Cryst., 1984, 104, 95. [all data]
Weinstein, Leffler, et al., 1984, 2
Weinstein, D.I.; Leffler, A.J.; Currie, J.A.,
Phase Transitions In Bicyclic Compounds,
Molecular Crystals and Liquid Crystals, 1984, 104, 1-2, 95-109, https://doi.org/10.1080/00268948408070401
. [all data]
Mjojo, 1979
Mjojo, Chodziwadziwa C.,
Order?disorder phenomena. Part 2.?Order?disorder phase equilibria in D- and L-systems of camphor and related compounds,
J. Chem. Soc., Faraday Trans. 2, 1979, 75, 692, https://doi.org/10.1039/f29797500692
. [all data]