Ethane, 1-chloro-2-fluoro-
- Formula: C2H4ClF
- Molecular weight: 82.505
- IUPAC Standard InChIKey: VEZJSKSPVQQGIS-UHFFFAOYSA-N
- CAS Registry Number: 762-50-5
- Chemical structure:
View 3d structure (requires JavaScript / HTML 5) - Other names: 1-Chloro-2-fluoroethane; TL 936

Phase change data

Data compiled as indicated in comments:
BS - Robert L. Brown and Stephen E. Stein
TRC - Thermodynamics Research Center, NIST Boulder Laboratories, Chris Muzny director
AC - William E. Acree, Jr., James S. Chickos
Quantity | Value | Units | Method | Reference | Comment |
---|---|---|---|---|---|
Tboil | 326.3 | K | N/A | PCR Inc., 1990 | BS |
Tboil | 325. | K | N/A | Titov, Veremeev, et al., 1957 | Uncertainty assigned by TRC = 3. K; TRC |
Tboil | 326.4 | K | N/A | Edgell and Parts, 1955 | Uncertainty assigned by TRC = 2. K; TRC |
Tboil | 326.4 | K | N/A | Hoffmann, 1950 | Uncertainty assigned by TRC = 1.5 K; TRC |
Enthalpy of vaporization
ΔvapH (kJ/mol) | Temperature (K) | Method | Reference | Comment |
---|---|---|---|---|
32.1 | 303. | A | Stephenson and Malanowski, 1987 | Based on data from 288. to 327. K.; AC |

Normal alkane RI, non-polar column, temperature ramp

Column type | Active phase | I | Reference | Comment |
---|---|---|---|---|
Capillary | OV-101 | 545. | Zenkevich, 2005 | 25. m/0.20 mm/0.10 μm, N2/He, 6. K/min; Tstart: 50. C; Tend: 250. C |

References

PCR Inc., 1990
PCR Inc.,
Research Chemicals Catalog 1990-1991, PCR Inc., Gainesville, FL, 1990, 1. [all data]
Titov, Veremeev, et al., 1957
Titov, A.I.; Veremeev, G.N.; Smirnov, V.V.; Shapilov, O.D.,
Dokl. Akad. Nauk SSSR, 1957, 113, 358. [all data]
Edgell and Parts, 1955
Edgell, W.F.; Parts, G.A.,
Synthesis of Alkyl and Substituted Alkyl Fluorides from p-Toluenesulfonic Acid Esters. The Preparation of p-Toluenesulfonic Acid Esters of Lower Alcohols,
J. Am. Chem. Soc., 1955, 77, 4899. [all data]
Hoffmann, 1950
Hoffmann, F.W.,
J. Org. Chem., 1950, 15, 425. [all data]
Stephenson and Malanowski, 1987
Stephenson, Richard M.; Malanowski, Stanislaw,
Handbook of the Thermodynamics of Organic Compounds, 1987, https://doi.org/10.1007/978-94-009-3173-2
. [all data]
Zenkevich, 2005
Zenkevich, I.G.,
Experimentally measured retention indices., 2005. [all data]