4-Propionyl-4'-n-heptanoyloxyazobenzene

Phase change data

Data compiled by: Eugene S. Domalski and Elizabeth D. Hearing

Enthalpy of fusion

ΔfusH (kJ/mol) Temperature (K) Reference Comment
24.811365.15Fanelli, Poeti, et al., 1983Solid - smectic A.

Entropy of fusion

ΔfusS (J/mol*K) Temperature (K) Reference Comment
67.95365.15Fanelli, Poeti, et al., 1983Solid

Enthalpy of phase transition

ΔHtrs (kJ/mol) Temperature (K) Initial Phase Final Phase Reference Comment
0.084358.55liquid, Hexaticliquid, monotropic smectic BFanelli, Poeti, et al., 1983
1.590362.85liquid, Smectic Aliquid, monotropic hexaticFanelli, Poeti, et al., 1983
5.314414.65liquid, Smectic Aliquid, nematicFanelli, Poeti, et al., 1983
0.920416.65liquid, Nematicliquid, isotropicFanelli, Poeti, et al., 1983

References

Fanelli, Poeti, et al., 1983
Fanelli, E.; Poeti, G.; Braghetti, M., Calorimetric study of 4-propionyl-4'-n-alkanoyloxyazobenzene series, Mol. Cryst. Liq. Cryst., 1983, 92, 127-134. [all data]