4-Propionyl-4'-n-pentadecanoyloxyazobenzene

Phase change data

Data compiled by: Eugene S. Domalski and Elizabeth D. Hearing

Enthalpy of fusion

ΔfusH (kJ/mol) Temperature (K) Reference Comment
51.505376.65Fanelli, Poeti, et al., 1983Solid-smectic A.

Entropy of fusion

ΔfusS (J/mol*K) Temperature (K) Reference Comment
136.7376.65Fanelli, Poeti, et al., 1983Solid-smectic

Enthalpy of phase transition

ΔHtrs (kJ/mol) Temperature (K) Initial Phase Final Phase Reference Comment
8.452412.15liquidliquidFanelli, Poeti, et al., 1983

Entropy of phase transition

ΔStrs (J/mol*K) Temperature (K) Initial Phase Final Phase Reference Comment
20.5412.15liquid, Smectic Aliquid, isotropicFanelli, Poeti, et al., 1983

References

Fanelli, Poeti, et al., 1983
Fanelli, E.; Poeti, G.; Braghetti, M., Calorimetric study of 4-propionyl-4'-n-alkanoyloxyazobenzene series, Mol. Cryst. Liq. Cryst., 1983, 92, 127-134. [all data]