Ethane, hexafluoro-
- Formula: C2F6
- Molecular weight: 138.0118
- IUPAC Standard InChIKey: WMIYKQLTONQJES-UHFFFAOYSA-N
- CAS Registry Number: 76-16-4
- Chemical structure:
View 3d structure (requires JavaScript / HTML 5) - Other names: Perfluoroethane; F-116; Freon 116; Hexafluoroethane; C2F6; Fluorocarbon 116; UN 2193; Freon 1166SY; 1,1,1,2,2,2-Hexafluoroethane; R 116; Ethane, 1,1,1,2,2,2-hexafluoro-; HFC 116

Gas phase thermochemistry data

Data compiled as indicated in comments:
ALS - Hussein Y. Afeefy, Joel F. Liebman, and Stephen E. Stein
Quantity | Value | Units | Method | Reference | Comment |
---|---|---|---|---|---|
ΔfH°gas | -1343.90 | kJ/mol | Review | Chase, 1998 | Data last reviewed in June, 1969 |
ΔfH°gas | -1344. ± 5.0 | kJ/mol | Eqk | Walker, Sinke, et al., 1970 | ALS |
ΔfH°gas | -1330. | kJ/mol | Eqk | Coomber and Whittle, 1967 | ALS |
ΔfH°gas | -1331. ± 8. | kJ/mol | Ccb | Sinke, 1966 | ALS |
ΔfH°gas | -1344.0 ± 4.0 | kJ/mol | Cm | Kirkbride and Davidson, 1954 | Reanalyzed by Kolesov and Papina, 1983, Original value = -1270. ± 8. kJ/mol; Von Wartenberg method; ALS |
Quantity | Value | Units | Method | Reference | Comment |
S°gas,1 bar | 332.09 | J/mol*K | Review | Chase, 1998 | Data last reviewed in June, 1969 |
Gas Phase Heat Capacity (Shomate Equation)
Cp° = A + B*t + C*t2 + D*t3 +
E/t2
H° − H°298.15= A*t + B*t2/2 +
C*t3/3 + D*t4/4 − E/t + F − H
S° = A*ln(t) + B*t + C*t2/2 + D*t3/3 −
E/(2*t2) + G
Cp = heat capacity (J/mol*K)
H° = standard enthalpy (kJ/mol)
S° = standard entropy (J/mol*K)
t = temperature (K) / 1000.
View plot Requires a JavaScript / HTML 5 canvas capable browser.
Temperature (K) | 298. to 1400. | 1400. to 6000. |
---|---|---|
A | 69.74728 | 176.9522 |
B | 225.3599 | 1.023370 |
C | -174.1628 | -0.193084 |
D | 47.14657 | 0.010897 |
E | -1.455677 | -11.17956 |
F | -1378.180 | -1429.213 |
G | 348.4444 | 496.5780 |
H | -1343.901 | -1343.901 |
Reference | Chase, 1998 | Chase, 1998 |
Comment | Data last reviewed in June, 1969 | Data last reviewed in June, 1969 |

Condensed phase thermochemistry data

Data compiled by: Eugene S. Domalski and Elizabeth D. Hearing
Quantity | Value | Units | Method | Reference | Comment |
---|---|---|---|---|---|
S°liquid | 250.54 | J/mol*K | N/A | Pace and Aston, 1948 |
Constant pressure heat capacity of liquid
Cp,liquid (J/mol*K) | Temperature (K) | Reference | Comment |
---|---|---|---|
131.3 | 195. | Pace and Aston, 1948 | T = 12 to 195 K. |

Phase change data

Data compiled as indicated in comments:
BS - Robert L. Brown and Stephen E. Stein
TRC - Thermodynamics Research Center, NIST Boulder Laboratories, Chris Muzny director
DH - Eugene S. Domalski and Elizabeth D. Hearing
AC - William E. Acree, Jr., James S. Chickos
CAL - James S. Chickos, William E. Acree, Jr., Joel F. Liebman, Students of Chem 202 (Introduction to the Literature of Chemistry), University of Missouri -- St. Louis
Quantity | Value | Units | Method | Reference | Comment |
---|---|---|---|---|---|
Tboil | 195. ± 2. | K | AVG | N/A | Average of 12 values; Individual data points |
Quantity | Value | Units | Method | Reference | Comment |
Tfus | 173.1 | K | N/A | Thorp and Scott, 1956 | Uncertainty assigned by TRC = 0.5 K; TRC |
Tfus | 172.65 | K | N/A | Ruff and Bretschneider, 1933 | Uncertainty assigned by TRC = 0.5 K; TRC |
Tfus | 166.85 | K | N/A | Swarts, 1933 | Uncertainty assigned by TRC = 0.02 K; TRC |
Quantity | Value | Units | Method | Reference | Comment |
Ttriple | 173.08 | K | N/A | Lobo and Staveley, 1979 | Uncertainty assigned by TRC = 0.005 K; TRC |
Ttriple | 173.10 | K | N/A | Pace and Aston, 1948, 2 | Crystal phase 1 phase; Uncertainty assigned by TRC = 0.02 K; TRC |
Quantity | Value | Units | Method | Reference | Comment |
Ptriple | 0.2625 | bar | N/A | Lobo and Staveley, 1979 | Uncertainty assigned by TRC = 0.00004 bar; TRC |
Ptriple | 0.3026 | bar | N/A | Swarts, 1933 | Uncertainty assigned by TRC = 0.0001 bar; TRC |
Quantity | Value | Units | Method | Reference | Comment |
Tc | 292.8 | K | N/A | Majer and Svoboda, 1985 | |
Tc | 293.030 | K | N/A | Saikawa, Kijima, et al., 1979 | Uncertainty assigned by TRC = 0.01 K; TRC |
Tc | 293.01 | K | N/A | Kijima, Saikawa, et al., 1977 | Uncertainty assigned by TRC = 0.01 K; TRC |
Tc | 292.66 | K | N/A | Kim, 1974 | Uncertainty assigned by TRC = 0.05 K; TRC |
Tc | 292.85 | K | N/A | Swarts, 1933 | Uncertainty assigned by TRC = 0.05 K; TRC |
Quantity | Value | Units | Method | Reference | Comment |
Pc | 30.42 | bar | N/A | Saikawa, Kijima, et al., 1979 | Uncertainty assigned by TRC = 0.08 bar; derived from published vapor pressure data; TRC |
Pc | 30.40 | bar | N/A | Kijima, Saikawa, et al., 1977 | Uncertainty assigned by TRC = 0.011 bar; TRC |
Pc | 30.1301 | bar | N/A | Kim, 1974 | Uncertainty assigned by TRC = 0.0344 bar; TRC |
Quantity | Value | Units | Method | Reference | Comment |
ρc | 4.51 | mol/l | N/A | Saikawa, Kijima, et al., 1979 | Uncertainty assigned by TRC = 0.072 mol/l; TRC |
ρc | 4.20 | mol/l | N/A | Kijima, Saikawa, et al., 1977 | Uncertainty assigned by TRC = 0.14 mol/l; TRC |
Enthalpy of vaporization
ΔvapH (kJ/mol) | Temperature (K) | Method | Reference | Comment |
---|---|---|---|---|
16.150 | 194.87 | N/A | Pace and Aston, 1948 | P = 101.325 kPA; DH |
17.3 | 186. | A | Stephenson and Malanowski, 1987 | Based on data from 172. to 200. K.; AC |
16.15 | 195. | N/A | Majer and Svoboda, 1985 | |
17.1 | 188. | N/A | Pace and Aston, 1948 | Based on data from 180. to 196. K.; AC |
Enthalpy of vaporization
ΔvapH =
A exp(-βTr) (1 − Tr)β
ΔvapH =
Enthalpy of vaporization (at saturation pressure)
(kJ/mol)
Tr = reduced temperature (T / Tc)
View plot Requires a JavaScript / HTML 5 canvas capable browser.
Temperature (K) | A (kJ/mol) | β | Tc (K) | Reference | Comment |
---|---|---|---|---|---|
180. to 195. | 24.31 | 0.232 | 292.8 | Majer and Svoboda, 1985 |
Entropy of vaporization
ΔvapS (J/mol*K) | Temperature (K) | Reference | Comment |
---|---|---|---|
82.88 | 194.87 | Pace and Aston, 1948 | P; DH |
Antoine Equation Parameters
log10(P) = A − (B / (T + C))
P = vapor pressure (bar)
T = temperature (K)
View plot Requires a JavaScript / HTML 5 canvas capable browser.
Temperature (K) | A | B | C | Reference | Comment |
---|---|---|---|---|---|
179.96 to 195.21 | 3.98013 | 677.112 | -24.506 | Pace and Aston, 1948 | Coefficents calculated by NIST from author's data. |
Enthalpy of sublimation
ΔsubH (kJ/mol) | Temperature (K) | Reference | Comment |
---|---|---|---|
26.0 | 103. | Bondi, 1963 | See also Pace and Aston, 1948.; AC |
Enthalpy of fusion
ΔfusH (kJ/mol) | Temperature (K) | Reference | Comment |
---|---|---|---|
2.69 | 173.1 | Domalski and Hearing, 1996 | AC |
Entropy of fusion
ΔfusS (J/mol*K) | Temperature (K) | Reference | Comment |
---|---|---|---|
35.9 | 104.0 | Domalski and Hearing, 1996 | CAL |
15.5 | 173.1 |
Enthalpy of phase transition
ΔHtrs (kJ/mol) | Temperature (K) | Initial Phase | Final Phase | Reference | Comment |
---|---|---|---|---|---|
3.736 | 103.98 | crystaline, II | crystaline, I | Pace and Aston, 1948 | DH |
2.686 | 173.10 | crystaline, I | liquid | Pace and Aston, 1948 | DH |
Entropy of phase transition
ΔStrs (J/mol*K) | Temperature (K) | Initial Phase | Final Phase | Reference | Comment |
---|---|---|---|---|---|
35.93 | 103.98 | crystaline, II | crystaline, I | Pace and Aston, 1948 | DH |
15.52 | 173.10 | crystaline, I | liquid | Pace and Aston, 1948 | DH |

Reaction thermochemistry data

Data compiled by: Hussein Y. Afeefy, Joel F. Liebman, and Stephen E. Stein
Individual Reactions
By formula: 3C2F6 + 2F3N = 6CF4 + N2
Quantity | Value | Units | Method | Reference | Comment |
---|---|---|---|---|---|
ΔrH° | -1304. ± 13. | kJ/mol | Ccb | Sinke, 1966 | gas phase |
By formula: C2N2 + C2F6 = 2C2F3N
Quantity | Value | Units | Method | Reference | Comment |
---|---|---|---|---|---|
ΔrH° | 44.10 ± 0.59 | kJ/mol | Eqk | Walker, Sinke, et al., 1970 | gas phase |
By formula: C2F6 + Br2 = 2CBrF3
Quantity | Value | Units | Method | Reference | Comment |
---|---|---|---|---|---|
ΔrH° | 15.3 ± 0.59 | kJ/mol | Eqk | Coomber and Whittle, 1967 | gas phase |

Henry's Law data

Data compiled by: Rolf Sander
Henry's Law constant (water solution)
kH(T) = k°H exp(d(ln(kH))/d(1/T) ((1/T) - 1/(298.15 K)))
k°H = Henry's law constant for solubility in water at 298.15 K (mol/(kg*bar))
d(ln(kH))/d(1/T) = Temperature dependence constant (K)
k°H (mol/(kg*bar)) | d(ln(kH))/d(1/T) (K) | Method | Reference | Comment |
---|---|---|---|---|
0.000058 | Q | N/A | missing citation give several references for the Henry's law constants but don't assign them to specific species. |

Gas phase ion energetics data

Data compiled as indicated in comments:
LLK - Sharon G. Lias, Rhoda D. Levin, and Sherif A. Kafafi
RDSH - Henry M. Rosenstock, Keith Draxl, Bruce W. Steiner, and John T. Herron
Ionization energy determinations
IE (eV) | Method | Reference | Comment |
---|---|---|---|
13.6 | PE | Inghram, Hanson, et al., 1980 | LLK |
14.4 | PE | Inghram, Hanson, et al., 1980 | Vertical value; LLK |
14.6 | PE | Sauvageau, Doucet, et al., 1974 | Vertical value; LLK |
Appearance energy determinations
Ion | AE (eV) | Other Products | Method | Reference | Comment |
---|---|---|---|---|---|
CF+ | 16.75 | ? | PI | Noutary, 1968 | RDSH |
CF+ | 16.1 | ? | EI | Smith and Kevan, 1967 | RDSH |
CF3+ | 13.62 ± 0.015 | CF3 | PI | Noutary, 1968 | RDSH |
C2F4+ | 20.7 | ? | EI | Smith and Kevan, 1967 | RDSH |
C2F5+ | 14.94 ± 0.05 | F | PIPECO | Simm, Danby, et al., 1975 | LLK |
C2F5+ | 15.46 ± 0.02 | F | PI | Noutary, 1968 | RDSH |
F+ | 22.6 | ? | EI | Bibby and Carter, 1963 | RDSH |

Normal alkane RI, non-polar column, custom temperature program

Column type | Active phase | I | Reference | Comment |
---|---|---|---|---|
Capillary | Porapack Q | 156. | Zenkevich and Rodin, 2004 | Program: not specified |

Vibrational and/or electronic energy levels

Data compiled by: Takehiko Shimanouchi
Symmetry: D3d Symmetry Number σ = 6
Sym. | No | Approximate | Selected Freq. | Infrared | Raman | Comments | ||||
---|---|---|---|---|---|---|---|---|---|---|
Species | type of mode | Value | Rating | Value | Phase | Value | Phase | |||
a1g | 1 | CC str | 1228 | D | ia | 1228 | gas | OC ( )Mean value of frequencies obtained from six combination bands. | ||
a1g | 2 | CF3 s-str | 807 | C | ia | 807 VS p | gas | |||
a1g | 3 | CF3 s-deform | 348 | C | ia | 348 W p | gas | |||
a1u | 4 | Torsion | 68 | D | ia | ia | CF | |||
a2u | 5 | CF3 s-str | 1117 | B | 1117 VS | gas | ia | |||
a2u | 6 | CF3 s-deform | 714 | B | 714 VS | gas | ia | |||
eg | 7 | CF3 d-str | 1250 | C | ia | 1250 VW dp | gas | |||
eg | 8 | CF3 d-deform | 619 | C | ia | 619 W dp | gas | |||
eg | 9 | CF3 rock | 372 | C | ia | 372 W dp | gas | |||
eu | 10 | CF3 d-str | 1251 | B | 1251 VS | gas | ia | |||
eu | 11 | CF3 d-deform | 520 | C | 520 S | gas | ia | |||
eu | 12 | CF3 rock | 220 | C | 220 S | gas | ia | |||
Source: Shimanouchi, 1972

References

Chase, 1998
Chase, M.W., Jr.,
NIST-JANAF Themochemical Tables, Fourth Edition,
J. Phys. Chem. Ref. Data, Monograph 9, 1998, 1-1951. [all data]
Walker, Sinke, et al., 1970
Walker, L.C.; Sinke, G.C.; Perettie, D.J.; Janz, G.J.,
Enthalpy of formation of trifluoroacetonitrile,
J. Am. Chem. Soc., 1970, 92, 4525-4526. [all data]
Coomber and Whittle, 1967
Coomber, J.W.; Whittle, E.,
Bond dissociation energies from equilibrium studies. Part 2.-D(CF3-CF3) and enthalpy of formation of C2F6,
Trans. Faraday Soc., 1967, 63, 1394-1401. [all data]
Sinke, 1966
Sinke, G.C.,
The heat of reaction of nitrogen trifluoride and hexafluoroethane,
J. Phys. Chem., 1966, 70, 1326-1327. [all data]
Kirkbride and Davidson, 1954
Kirkbride, F.W.; Davidson, F.G.,
Heats of formation of gaseous fluoro- and fluorochloro-carbons,
Nature (London), 1954, 174, 79-80. [all data]
Kolesov and Papina, 1983
Kolesov, V.P.; Papina, T.S.,
Thermochemistry of Haloethanes,
Russ. Chem. Rev., 1983, 52, 425. [all data]
Pace and Aston, 1948
Pace, E.L.; Aston, J.G.,
The thermodynamics of hexafluoroethane from calorimetric and spectroscopic data,
J. Am. Chem. Soc., 1948, 70, 566-570. [all data]
Thorp and Scott, 1956
Thorp, N.; Scott, R.L.,
Fluorocarbon solutions at low termperatures. I. The liquid mixtures CF4-CHF3, CF4-CH4, CF4-Kr, CH4-Kr.,
J. Phys. Chem., 1956, 60, 670. [all data]
Ruff and Bretschneider, 1933
Ruff, O.; Bretschneider, O.,
The Preparation of Hexafluoroethane and Tetrafluoroethene from Tetrafluoromethane,
Z. Anorg. Allg. Chem., 1933, 210, 173. [all data]
Swarts, 1933
Swarts, F.,
Hexafluoroethane.,
Bull. Soc. Chim. Belg., 1933, 42, 114. [all data]
Lobo and Staveley, 1979
Lobo, L.Q.; Staveley, L.A.K.,
The vapour pressure of tetrafluoromethane.,
Cryogenics, 1979, 19, 335. [all data]
Pace and Aston, 1948, 2
Pace, E.L.; Aston, J.G.,
The thermodynamics of hexafluoroethane from calorimetric and spectroscopic data,
J. Am. Chem. Soc., 1948, 70, 566. [all data]
Majer and Svoboda, 1985
Majer, V.; Svoboda, V.,
Enthalpies of Vaporization of Organic Compounds: A Critical Review and Data Compilation, Blackwell Scientific Publications, Oxford, 1985, 300. [all data]
Saikawa, Kijima, et al., 1979
Saikawa, K.; Kijima, J.; Uematsu, M.; Watanabe, K.,
Determination of the critical temperature and density of hexafluoroethane,
J. Chem. Eng. Data, 1979, 24, 165-7. [all data]
Kijima, Saikawa, et al., 1977
Kijima, J.; Saikawa, K.; Watanabe, K.; Oguchi, K.; Tanishita, I.,
Experimental study of thermodyn. prop. of hexafluoroethane (R116)
in Proc. Symp. Thermophys. Prop., 7th, Cezairliyan, A., Ed., ASME: New York, p 480, 1977. [all data]
Kim, 1974
Kim, K.Y.,
Calorimetric studies on argon and Hexafluoroethane and a generalized correlation of maxima in isobaric heat capacity., Ph.D. Dissertation, Univ. Mich., Ann Arbour, MI, 1974. [all data]
Stephenson and Malanowski, 1987
Stephenson, Richard M.; Malanowski, Stanislaw,
Handbook of the Thermodynamics of Organic Compounds, 1987, https://doi.org/10.1007/978-94-009-3173-2
. [all data]
Bondi, 1963
Bondi, A.,
Heat of Siblimation of Molecular Crystals: A Catalog of Molecular Structure Increments.,
J. Chem. Eng. Data, 1963, 8, 3, 371-381, https://doi.org/10.1021/je60018a027
. [all data]
Domalski and Hearing, 1996
Domalski, Eugene S.; Hearing, Elizabeth D.,
Heat Capacities and Entropies of Organic Compounds in the Condensed Phase. Volume III,
J. Phys. Chem. Ref. Data, 1996, 25, 1, 1, https://doi.org/10.1063/1.555985
. [all data]