Benzene, 1,1'-(3-methyl-1-propene-1,3-diyl)bis-
- Formula: C16H16
- Molecular weight: 208.2982
- IUPAC Standard InChIKey: GNQWHYWLSGTMSL-OUKQBFOZSA-N
- CAS Registry Number: 7614-93-9
- Chemical structure:
View 3d structure (requires JavaScript / HTML 5) - Other names: 1-Butene, 1,3-diphenyl-; 1,3-Diphenyl-1-butene; 1,3-Diphenylbutene-1

Normal alkane RI, non-polar column, temperature ramp

Column type | Active phase | I | Reference | Comment |
---|---|---|---|---|
Packed | SE-30 | 1740. | Khudobina and Zenkevich, 1984 | Helium, Chromosorb W (80-100 mesh), 50. C @ 0. min, 5. K/min, 250. C @ 0. min; Column length: 1.8 m |

References

Khudobina and Zenkevich, 1984
Khudobina, G.V.; Zenkevich, I.G.,
Chromato Mass Spectrometric Identification of Dimers in Recycled Styrene, VINITI, # 8039-84, 1984, 14. [all data]