Hexan-3-yl trifluoroacetate
- Formula: C8H13F3O2
- Molecular weight: 198.1828
- IUPAC Standard InChIKey: TXLRKFWFZMQEOY-UHFFFAOYSA-N
- CAS Registry Number: 761-34-2
- Chemical structure:
View 3d structure (requires JavaScript / HTML 5) - Other names: 3-Hexanol, trifluoroacetate; 3-Hexyltrifluoroacetate

Reaction thermochemistry data

Data compiled by: Hussein Y. Afeefy, Joel F. Liebman, and Stephen E. Stein
Individual Reactions
By formula: C8H13F3O2 = C8H13F3O2
Quantity | Value | Units | Method | Reference | Comment |
---|---|---|---|---|---|
ΔrH° | 0.720 ± 0.088 | kJ/mol | Eqk | Wiberg and Wasserman, 1981 | liquid phase; Trifluoroacetolysis |
By formula: C4F6O3 + C6H14O = C2HF3O2 + C8H13F3O2
Quantity | Value | Units | Method | Reference | Comment |
---|---|---|---|---|---|
ΔrH° | -92.68 ± 0.04 | kJ/mol | Cm | Wiberg and Wasserman, 1981 | liquid phase |

Van Den Dool and Kratz RI, non-polar column, custom temperature program

Column type | Active phase | I | Reference | Comment |
---|---|---|---|---|
Capillary | VF-5MS | 796.4 | Tret'yakov, 2008 | 30. m/0.25 mm/0.25 μm, He; Program: Multi-step temperature program; T(initial)=60C; T(final)=270C |

References

Wiberg and Wasserman, 1981
Wiberg, K.B.; Wasserman, D.J.,
Enthalpies of hydration of alkenes. 1. The n-hexenes,
J. Am. Chem. Soc., 1981, 103, 6563-6566. [all data]
Tret'yakov, 2008
Tret'yakov, K.V.,
Retention Data. NIST Mass Spectrometry Data Center., NIST Mass Spectrometry Data Center, 2008. [all data]