1-Butene, 1-chloro-, (Z)-
- Formula: C4H7Cl
- Molecular weight: 90.551
- IUPAC Standard InChIKey: DUDKKPVINWLFBI-ARJAWSKDSA-N
- CAS Registry Number: 7611-86-1
- Chemical structure:
View 3d structure (requires JavaScript / HTML 5) - Stereoisomers:
- Other names: cis-1-Chloro-1-butene; (1Z)-1-Chloro-1-butene; (Z)-1-Chlorobut-1-ene; (Z)-1-Chloro-1-butene

Gas phase thermochemistry data

Data compiled by: Hussein Y. Afeefy, Joel F. Liebman, and Stephen E. Stein
Quantity | Value | Units | Method | Reference | Comment |
---|---|---|---|---|---|
ΔfH°gas | -19.2 | kJ/mol | Eqk | Levanova, Rodova, et al., 1974 |

Phase change data

Data compiled as indicated in comments:
BS - Robert L. Brown and Stephen E. Stein
TRC - Thermodynamics Research Center, NIST Boulder Laboratories, Chris Muzny director
Quantity | Value | Units | Method | Reference | Comment |
---|---|---|---|---|---|
Tboil | 336.7 | K | N/A | Weast and Grasselli, 1989 | BS |
Tboil | 336.65 | K | N/A | Kinney, 1942 | Uncertainty assigned by TRC = 1. K; uncertain whether this was measured; TRC |
Tboil | 336.65 | K | N/A | Navez, 1930 | Uncertainty assigned by TRC = 1. K; TRC |

Reaction thermochemistry data

Data compiled by: Hussein Y. Afeefy, Joel F. Liebman, and Stephen E. Stein
Individual Reactions
By formula: C4H8Cl2 = C4H7Cl + HCl
Quantity | Value | Units | Method | Reference | Comment |
---|---|---|---|---|---|
ΔrH° | 61.1 | kJ/mol | Eqk | Levanova, Rodova, et al., 1974 | gas phase |
ΔrH° | 61.1 ± 0.4 | kJ/mol | Eqk | Rodova, Shevtsova, et al., 1974 | gas phase |
By formula: C4H7Cl = C4H7Cl
Quantity | Value | Units | Method | Reference | Comment |
---|---|---|---|---|---|
ΔrH° | -2.8 ± 0.3 | kJ/mol | Eqk | Rodova, Shevtsova, et al., 1974 | gas phase |

References

Levanova, Rodova, et al., 1974
Levanova, S.V.; Rodova, R.M.; Rozhnov, A.M.; Shevtsova, L.A.,
Thermodynamic calculation of the equilibrium composition of chlorobutene mixtures,
Russ. J. Phys. Chem. (Engl. Transl.), 1974, 48, 1113-1114. [all data]
Weast and Grasselli, 1989
CRC Handbook of Data on Organic Compounds, 2nd Editon, Weast,R.C and Grasselli, J.G., ed(s)., CRC Press, Inc., Boca Raton, FL, 1989, 1. [all data]
Kinney, 1942
Kinney, C.R.,
A System Correlating Molecular Structure of Organic Compounds with Their Boiling Points VI. The Monohalogen Derivatives of the Various Hydrocarbons,
J. Org. Chem., 1942, 7, 111. [all data]
Navez, 1930
Navez, L.,
Bull. Soc. Chim. Belg., 1930, 39, 435. [all data]
Rodova, Shevtsova, et al., 1974
Rodova, R.M.; Shevtsova, L.A.; Levanova, S.V.; Rozhnov, A.M.; Garkushin, I.K.,
Dehydrochlorination of 1,1-dichlorobutane and isomerization of chlorobutenes,
Izv. Vyssh. Uchebn. Zaved., Khim. Khim. Tekhnol., 1974, 17, 379-381. [all data]