1,3-Cyclopentadiene, 1,2,3,4-tetramethyl-5-methylene-
- Formula: C10H14
- Molecular weight: 134.2182
- IUPAC Standard InChIKey: RYLMKTLFCIGRQD-UHFFFAOYSA-N
- CAS Registry Number: 76089-59-3
- Chemical structure:
View 3d structure (requires JavaScript / HTML 5) - Other names: 1,2,3,4-Tetramethylfulvene

Gas phase thermochemistry data

Data compiled by: Hussein Y. Afeefy, Joel F. Liebman, and Stephen E. Stein
Quantity | Value | Units | Method | Reference | Comment |
---|---|---|---|---|---|
ΔfH°gas | 83.3 | kJ/mol | Chyd | Roth, Adamczak, et al., 1991 |

Reaction thermochemistry data

Data compiled by: Hussein Y. Afeefy, Joel F. Liebman, and Stephen E. Stein
Individual Reactions
By formula: 3H2 + C10H14 = C10H20
Quantity | Value | Units | Method | Reference | Comment |
---|---|---|---|---|---|
ΔrH° | -296. ± 4. | kJ/mol | Chyd | Roth, Adamczak, et al., 1991 | liquid phase |

References

Roth, Adamczak, et al., 1991
Roth, W.R.; Adamczak, O.; Breuckmann, R.; Lennartz, H.-W.; Boese, R.,
Die Berechnung von Resonanzenergien; das MM2ERW-Kraftfeld,
Chem. Ber., 1991, 124, 2499-2521. [all data]