N,N-Dimethylbutyramide
- Formula: C6H13NO
- Molecular weight: 115.1735
- IUPAC Standard InChIKey: VIJUZNJJLALGNJ-UHFFFAOYSA-N
- CAS Registry Number: 760-79-2
- Chemical structure:
View 3d structure (requires JavaScript / HTML 5) - Other names: Butanamide, N,N-dimethyl-; Butyramide, N,N-dimethyl-; N,N-Dimethyl-n-butyramide; N,N-Dimethylbutanamide

Gas phase thermochemistry data

Data compiled by: Hussein Y. Afeefy, Joel F. Liebman, and Stephen E. Stein
Quantity | Value | Units | Method | Reference | Comment |
---|---|---|---|---|---|
ΔfH°gas | -270.9 | kJ/mol | Ccb | Vasil'eva and Kotov, 1977 |

Condensed phase thermochemistry data

Data compiled by: Hussein Y. Afeefy, Joel F. Liebman, and Stephen E. Stein
Quantity | Value | Units | Method | Reference | Comment |
---|---|---|---|---|---|
ΔcH°liquid | -3893.0 ± 1.3 | kJ/mol | Ccb | Vasil'eva and Kotov, 1977 |

Phase change data

Data compiled as indicated in comments:
BS - Robert L. Brown and Stephen E. Stein
ALS - Hussein Y. Afeefy, Joel F. Liebman, and Stephen E. Stein
AC - William E. Acree, Jr., James S. Chickos
Quantity | Value | Units | Method | Reference | Comment |
---|---|---|---|---|---|
ΔvapH° | 55.19 | kJ/mol | V | Vasil'eva and Kotov, 1977 | ALS |
Reduced pressure boiling point
Tboil (K) | Pressure (bar) | Reference | Comment |
---|---|---|---|
353. to 355. | 0.020 | Frinton Laboratories Inc., 1986 | BS |
Enthalpy of vaporization
ΔvapH (kJ/mol) | Temperature (K) | Method | Reference | Comment |
---|---|---|---|---|
50.8 | 366. | A | Stephenson and Malanowski, 1987 | Based on data from 251. to 432. K.; AC |

Gas phase ion energetics data

Data evaluated as indicated in comments:
HL - Edward P. Hunter and Sharon G. Lias
Data compiled as indicated in comments:
MM - Michael M. Meot-Ner (Mautner)
Quantity | Value | Units | Method | Reference | Comment |
---|---|---|---|---|---|
Proton affinity (review) | 921.7 | kJ/mol | N/A | Hunter and Lias, 1998 | HL |
Quantity | Value | Units | Method | Reference | Comment |
Gas basicity | 890.8 | kJ/mol | N/A | Hunter and Lias, 1998 | HL |
Gas basicity at 298K
Gas basicity (review) (kJ/mol) | Reference | Comment |
---|---|---|
898. ± 8. | Witt and Grutzmacher, 1997 | Pyridine. GB lower limit. Data readjusted to Hunter and Lias, 1998; MM |

Kovats' RI, non-polar column, isothermal

Column type | Active phase | Temperature (C) | I | Reference | Comment |
---|---|---|---|---|---|
Packed | SE-30 | 180. | 978. | Oszczapowicz, Ciszkowski, et al., 1986 | N2, Chromosorb W AW; Column length: 3. m |

References

Vasil'eva and Kotov, 1977
Vasil'eva, T.F.; Kotov, V.I.,
Heats of combustion of dimethyl-substituted amides and dimethylalkylamines,
Vses. Konf. Kalorim. Rasshir. Tezisy Dokl. 7th, 1977, 1, 102-106. [all data]
Frinton Laboratories Inc., 1986
Frinton Laboratories Inc.,
Catalog Number 11, Frinton Laboratories Inc., Vineland, NJ, 1986, 99. [all data]
Stephenson and Malanowski, 1987
Stephenson, Richard M.; Malanowski, Stanislaw,
Handbook of the Thermodynamics of Organic Compounds, 1987, https://doi.org/10.1007/978-94-009-3173-2
. [all data]
Hunter and Lias, 1998
Hunter, E.P.; Lias, S.G.,
Evaluated Gas Phase Basicities and Proton Affinities of Molecules: An Update,
J. Phys. Chem. Ref. Data, 1998, 27, 3, 413-656, https://doi.org/10.1063/1.556018
. [all data]
Witt and Grutzmacher, 1997
Witt, M.; Grutzmacher, H.F.,
Proton-bound dimers of aliphatic carboxamides: gas-phase basicity and dissociation energy,
Int. J. Mass Spectrom. Ion Processes, 1997, 165, 49. [all data]
Oszczapowicz, Ciszkowski, et al., 1986
Oszczapowicz, J.; Ciszkowski, K.; Osek, J.,
Amidines. XXVI. Retention indices of N1,N1-dimethylpropionamidines, isobutyramidines, pivalamidines and phenylacetamidines on a non-polar column,
J. Chromatogr., 1986, 362, 383-389, https://doi.org/10.1016/S0021-9673(01)86990-9
. [all data]