DL-Norvaline
- Formula: C5H11NO2
- Molecular weight: 117.1463
- IUPAC Standard InChIKey: SNDPXSYFESPGGJ-UHFFFAOYSA-N
- CAS Registry Number: 760-78-1
- Chemical structure:
View 3d structure (requires JavaScript / HTML 5) - Stereoisomers:
- Other names: α-DL-Aminopentanoic acid; (.+/-.)-Norvaline; DL-α-Aminovaleric acid; DL-2-Aminopentanoic acid; Norvaline, DL-; Valeric acid, 2-amino-, DL-; dl-α-Amino-N-valenic acid; Norvaline; NSC 7904; (dl) 2-aminopentanoic acid (DL-norvaline)

Phase change data

Data compiled by: William E. Acree, Jr., James S. Chickos
Enthalpy of sublimation
ΔsubH (kJ/mol) | Temperature (K) | Method | Reference | Comment |
---|---|---|---|---|
120. | 450. | N/A | Stephenson and Malanowski, 1987 | Based on data from 439. to 461. K. |
121.1 ± 0.4 | 455. | ME | Svec and Clyde, 1965 | See also Clyde and Svec, 1964. |

References

Stephenson and Malanowski, 1987
Stephenson, Richard M.; Malanowski, Stanislaw,
Handbook of the Thermodynamics of Organic Compounds, 1987, https://doi.org/10.1007/978-94-009-3173-2
. [all data]
Svec and Clyde, 1965
Svec, H.J.; Clyde, D.D.,
Vapor Pressures of Some α-Amino Acids.,
J. Chem. Eng. Data, 1965, 10, 2, 151-152, https://doi.org/10.1021/je60025a024
. [all data]
Clyde and Svec, 1964
Clyde, D.D.; Svec, H.,
, U. S. Atomic Energy Comm. IS-790, 1964, 1. [all data]