Ethyl (phenylthio)acetate
- Formula: C10H12O2S
- Molecular weight: 196.266
- IUPAC Standard InChIKey: SEDRTXNDGKRHBL-UHFFFAOYSA-N
- CAS Registry Number: 7605-25-6
- Chemical structure:
View 3d structure (requires JavaScript / HTML 5) - Other names: Ethyl (phenylsulfanyl)acetate; (Phenylthio)acetic acid, ethyl ester; Acetic acid, (phenylthio)-, ethyl ester

Van Den Dool and Kratz RI, non-polar column, custom temperature program

Column type | Active phase | I | Reference | Comment |
---|---|---|---|---|
Capillary | VF-5MS | 1522. | Tretyakov, 2011 | 30. m/0.25 mm/0.25 μm, He; Program: Multi-step temperature program; T(initial)=60C; T(final)=270C |
Capillary | 5 % Phenyl methyl siloxane | 1474. | Zaikin, 2003 | Column length: 30. m; Column diameter: 0.19 mm; Program: 50 C to 120 C at 5 C/min; 120 C to 290 C at 12 C/min |

References

Tretyakov, 2011
Tretyakov, K.V.,
Retention Data. NIST Mass Spectrometry Data Center., NIST Mass Spectrometry Data Center, 2011. [all data]
Zaikin, 2003
Zaikin, V.G.,
Personal Communication: Retention indices measured during the period 2001 to 2003, 2003. [all data]