Trichloroacetic Acid
- Formula: C2HCl3O2
- Molecular weight: 163.387
- IUPAC Standard InChIKey: YNJBWRMUSHSURL-UHFFFAOYSA-N
- CAS Registry Number: 76-03-9
- Chemical structure:

Gas phase thermochemistry data

Data compiled by: Hussein Y. Afeefy, Joel F. Liebman, and Stephen E. Stein
Quantity | Value | Units | Method | Reference | Comment |
---|---|---|---|---|---|
ΔfH°gas | -433.67 | kJ/mol | Cm | Trifel, Smirnov, et al., 1992 |

Condensed phase thermochemistry data

Data compiled as indicated in comments:
ALS - Hussein Y. Afeefy, Joel F. Liebman, and Stephen E. Stein
DH - Eugene S. Domalski and Elizabeth D. Hearing
Quantity | Value | Units | Method | Reference | Comment |
---|---|---|---|---|---|
ΔcH°solid | -497.5 ± 8.4 | kJ/mol | Ccb | Smith, Bjellerup, et al., 1953 | Reanalyzed by Cox and Pilcher, 1970, Original value = -498. ± 4. kJ/mol; ALS |
ΔcH°solid | -490.8 | kJ/mol | Ccb | Schjanberg, 1935 | ALS |
Constant pressure heat capacity of solid
Cp,solid (J/mol*K) | Temperature (K) | Reference | Comment |
---|---|---|---|
314. | 289. to 320. | Pickering, 1895 | T = 289 to 356 K.; DH |

Phase change data

Data compiled as indicated in comments:
BS - Robert L. Brown and Stephen E. Stein
TRC - Thermodynamics Research Center, NIST Boulder Laboratories, Chris Muzny director
AC - William E. Acree, Jr., James S. Chickos
DH - Eugene S. Domalski and Elizabeth D. Hearing
Quantity | Value | Units | Method | Reference | Comment |
---|---|---|---|---|---|
Tboil | 469.2 | K | N/A | Aldrich Chemical Company Inc., 1990 | BS |
Tboil | 470.7 | K | N/A | Weast and Grasselli, 1989 | BS |
Tboil | 468.35 | K | N/A | Paul and Schantz, 1919 | Uncertainty assigned by TRC = 0.5 K; TRC |
Quantity | Value | Units | Method | Reference | Comment |
Tfus | 332.31 | K | N/A | McDonald, Shrader, et al., 1959 | Uncertainty assigned by TRC = 0.07 K; TRC |
Tfus | 332. | K | N/A | Timmermans, 1935 | Uncertainty assigned by TRC = 1.5 K; TRC |
Tfus | 332.25 | K | N/A | Pickering, 1895 | Uncertainty assigned by TRC = 0.1 K; TRC |
Reduced pressure boiling point
Tboil (K) | Pressure (bar) | Reference | Comment |
---|---|---|---|
414.7 | 0.033 | Weast and Grasselli, 1989 | BS |
Enthalpy of vaporization
ΔvapH (kJ/mol) | Temperature (K) | Method | Reference | Comment |
---|---|---|---|---|
65.0 | 341. | A | Stephenson and Malanowski, 1987 | Based on data from 326. to 473. K. See also Dykyj, 1970.; AC |
57.2 | 400. | N/A | McDonald, Shrader, et al., 1959, 2 | Based on data from 385. to 470. K.; AC |
Antoine Equation Parameters
log10(P) = A − (B / (T + C))
P = vapor pressure (bar)
T = temperature (K)
View plot Requires a JavaScript / HTML 5 canvas capable browser.
Temperature (K) | A | B | C | Reference |
---|---|---|---|---|
385.77 to 471.08 | 4.43547 | 1618.97 | -105.268 | McDonald, Shrader, et al., 1959, 2 |
Enthalpy of fusion
ΔfusH (kJ/mol) | Temperature (K) | Reference | Comment |
---|---|---|---|
5.88 | 330.7 | Acree, 1991 | AC |
5.898 | 332.25 | Pickering, 1895 | DH |
Entropy of fusion
ΔfusS (J/mol*K) | Temperature (K) | Reference | Comment |
---|---|---|---|
17.75 | 332.25 | Pickering, 1895 | DH |

Reaction thermochemistry data

Data compiled as indicated in comments:
MS - José A. Martinho Simões
ALS - Hussein Y. Afeefy, Joel F. Liebman, and Stephen E. Stein
Individual Reactions
C14H10Cl6O4Ti (cr) + 2( • 4.40
) (solution) =
(cr) + 2
(cr)
By formula: C14H10Cl6O4Ti (cr) + 2(HCl • 4.40H2O) (solution) = C10H10Cl2Ti (cr) + 2C2HCl3O2 (cr)
Quantity | Value | Units | Method | Reference | Comment |
---|---|---|---|---|---|
ΔrH° | 13.4 ± 2.6 | kJ/mol | RSC | Dias, Salema, et al., 1984 | Please also see Calhorda, Carrondo, et al., 1986.; MS |
By formula: C2Cl4O + H2O = C2HCl3O2 + HCl
Quantity | Value | Units | Method | Reference | Comment |
---|---|---|---|---|---|
ΔrH° | -117.7 | kJ/mol | Cm | Pritchard and Skinner, 1950 | liquid phase; Heat of hydrolysis at 298 K; ALS |

Gas phase ion energetics data

Data evaluated by: Edward P. Hunter and Sharon G. Lias
Quantity | Value | Units | Method | Reference | Comment |
---|---|---|---|---|---|
Proton affinity (review) | 770.0 | kJ/mol | N/A | Hunter and Lias, 1998 | |
Quantity | Value | Units | Method | Reference | Comment |
Gas basicity | 739.1 | kJ/mol | N/A | Hunter and Lias, 1998 |

Normal alkane RI, non-polar column, custom temperature program

Column type | Active phase | I | Reference | Comment |
---|---|---|---|---|
Capillary | Methyl Silicone | 1390. | Zenkevich, 1996 | Program: not specified |

References

Trifel, Smirnov, et al., 1992
Trifel, B.Yu.; Smirnov, V.V.; Gloriozov, I.P.; Kurbanov, N.I.; Mamedov, F.V.,
Mechanism of reaction between trichloroacetic acid and unsaturated ketones,
Vestn. Mosk. Univ. Ser. 2: Khim., 1992, 33, 547-550. [all data]
Smith, Bjellerup, et al., 1953
Smith, L.; Bjellerup, L.; Krook, S.; Westermark, H.,
Heats of combustion of organic chloro compounds determined by the "quartz wool" method,
Acta Chem. Scand., 1953, 7, 65. [all data]
Cox and Pilcher, 1970
Cox, J.D.; Pilcher, G.,
Thermochemistry of Organic and Organometallic Compounds, Academic Press, New York, 1970, 1-636. [all data]
Schjanberg, 1935
Schjanberg, E.,
Die Verbrennungswarmen und die Refraktionsdaten einiger chlorsubstituierter Fettsauren und Ester.,
Z. Phys. Chem. Abt. A, 1935, 172, 197-233. [all data]
Pickering, 1895
Pickering, S.U.,
A comparison of some properties of acetic acid and its chloro- and bromo-derivatives,
J. Chem. Soc., 1895, 67, 664-684. [all data]
Aldrich Chemical Company Inc., 1990
Aldrich Chemical Company Inc.,
Catalog Handbook of Fine Chemicals, Aldrich Chemical Company, Inc., Milwaukee WI, 1990, 1. [all data]
Weast and Grasselli, 1989
CRC Handbook of Data on Organic Compounds, 2nd Editon, Weast,R.C and Grasselli, J.G., ed(s)., CRC Press, Inc., Boca Raton, FL, 1989, 1. [all data]
Paul and Schantz, 1919
Paul, T.; Schantz, K.,
The boiling point as indicator of purity and a new apparatus for its determination without thermometer correction.,
Arch. Pharm. (Weinheim, Ger.), 1919, 257, 87. [all data]
McDonald, Shrader, et al., 1959
McDonald, R.A.; Shrader, S.A.; Stull, D.R.,
Vapor Pressures and Freezing Points of 30 Organics,
J. Chem. Eng. Data, 1959, 4, 311. [all data]
Timmermans, 1935
Timmermans, J.,
Researches in Stoichiometry. I. The Heat of Fusion of Organic Compounds.,
Bull. Soc. Chim. Belg., 1935, 44, 17-40. [all data]
Stephenson and Malanowski, 1987
Stephenson, Richard M.; Malanowski, Stanislaw,
Handbook of the Thermodynamics of Organic Compounds, 1987, https://doi.org/10.1007/978-94-009-3173-2
. [all data]
Dykyj, 1970
Dykyj, J.,
Petrochemica, 1970, 10, 2, 51. [all data]
McDonald, Shrader, et al., 1959, 2
McDonald, R.A.; Shrader, S.A.; Stull, D.R.,
Vapor Pressures and Freezing Points of Thirty Pure Organic Compounds.,
J. Chem. Eng. Data, 1959, 4, 4, 311-313, https://doi.org/10.1021/je60004a009
. [all data]
Acree, 1991
Acree, William E.,
Thermodynamic properties of organic compounds: enthalpy of fusion and melting point temperature compilation,
Thermochimica Acta, 1991, 189, 1, 37-56, https://doi.org/10.1016/0040-6031(91)87098-H
. [all data]
Dias, Salema, et al., 1984
Dias, A.R.; Salema, M.S.; Martinho Simões, J.A.,
Rev. Port. Quím., 1984, 26, 227. [all data]
Calhorda, Carrondo, et al., 1986
Calhorda, M.J.; Carrondo, M.A.A.F.C.T.; Dias, A.R.; Domingos, A.M.T.S.; Martinho Simões, J.A.; Teixeira, C.,
Organometallics, 1986, 5, 660. [all data]
Pritchard and Skinner, 1950
Pritchard, H.O.; Skinner, H.A.,
The heats of hydrolysis of the chloro-substituted acetyl chlorides,
J. Chem. Soc., 1950, 272-276. [all data]
Hunter and Lias, 1998
Hunter, E.P.; Lias, S.G.,
Evaluated Gas Phase Basicities and Proton Affinities of Molecules: An Update,
J. Phys. Chem. Ref. Data, 1998, 27, 3, 413-656, https://doi.org/10.1063/1.556018
. [all data]