1H-Indene, 2,3,4,7-tetrahydro-
- Formula: C9H12
- Molecular weight: 120.1916
- IUPAC Standard InChIKey: PJEOOBRBALZZSL-UHFFFAOYSA-N
- CAS Registry Number: 7603-37-4
- Chemical structure:
View 3d structure (requires JavaScript / HTML 5) - Other names: 2,3,4,7-Tetrahydro-1H-indene; Bicyclo[4.3.0]nona-1(6),3-diene; 4,7-Dihydroindan; Indan, 4,7-dihydro-; Bicyclo[4.3.0]nona-3,6(1)-diene

Kovats' RI, non-polar column, isothermal

Column type | Active phase | Temperature (C) | I | Reference | Comment |
---|---|---|---|---|---|
Capillary | OV-101 | 100. | 1047. | Diez, Guillen, et al., 1990 | N2; Column length: 25. m; Column diameter: 0.23 mm |
Capillary | OV-101 | 80. | 1039. | Diez, Guillen, et al., 1990 | N2; Column length: 25. m; Column diameter: 0.23 mm |
Capillary | Squalane | 100. | 1037.5 | Diez, Guillen, et al., 1990 | N2; Column length: 45. m; Column diameter: 0.5 mm |
Capillary | Squalane | 80. | 1031.5 | Diez, Guillen, et al., 1990 | N2; Column length: 45. m; Column diameter: 0.5 mm |
Capillary | SE-54 | 100. | 1066.4 | Diez, Guillen, et al., 1990 | N2; Column length: 25. m; Column diameter: 0.22 mm |
Capillary | SE-54 | 80. | 1056.6 | Diez, Guillen, et al., 1990 | N2; Column length: 25. m; Column diameter: 0.22 mm |
Capillary | BP-1 | 100. | 1048. | Bermejo, Blanco, et al., 1987 | N2; Column length: 12. m; Column diameter: 0.22 mm |
Capillary | BP-1 | 80. | 1040. | Bermejo, Blanco, et al., 1987 | N2; Column length: 12. m; Column diameter: 0.22 mm |
Capillary | OV-101 | 100. | 1047. | Bermejo, Blanco, et al., 1987 | N2; Column length: 25. m; Column diameter: 0.23 mm |
Capillary | OV-101 | 80. | 1039. | Bermejo, Blanco, et al., 1987 | N2; Column length: 25. m; Column diameter: 0.23 mm |
Capillary | SE-30 | 130. | 1059. | Bredael, 1982 | Column length: 100. m; Column diameter: 0.5 mm |
Capillary | SE-30 | 150. | 1068. | Bredael, 1982 | Column length: 100. m; Column diameter: 0.5 mm |
Capillary | SE-30 | 80. | 1038. | Bredael, 1982 | Column length: 100. m; Column diameter: 0.5 mm |

Van Den Dool and Kratz RI, non-polar column, temperature ramp

Column type | Active phase | I | Reference | Comment |
---|---|---|---|---|
Capillary | Petrocol DH | 1038. | White, Hackett, et al., 1992 | 100. m/0.25 mm/0.5 μm, He, 1. K/min; Tstart: 30. C; Tend: 220. C |

Normal alkane RI, non-polar column, custom temperature program

Column type | Active phase | I | Reference | Comment |
---|---|---|---|---|
Capillary | OV-1, SE-30, Methyl silicone, SP-2100, OV-101, DB-1, etc. | 1038. | Waggott and Davies, 1984 | Hydrogen; Column length: 50. m; Column diameter: 0.32 mm; Program: not specified |

Phase change data

Data compiled by: Robert L. Brown and Stephen E. Stein

Quantity Value Units Method Reference Comment
Tboil451.2KN/AAldrich Chemical Company Inc., 1990

References

Diez, Guillen, et al., 1990
Diez, M.A.; Guillen, M.D.; Blanco, C.G.; Bermejo, J.,
Chromatographic study of methylcyclopentadiene dimers and iso-dimers and determination of their boiling points,
J. Chromatogr., 1990, 508, 363-374, https://doi.org/10.1016/S0021-9673(00)91279-2
. [all data]
Bermejo, Blanco, et al., 1987
Bermejo, J.; Blanco, C.G.; Diez, M.A.; Guillén, M.D.,
Kováts retention indices of selected mono and polycyclic olefins,
J. Hi. Res. Chromatogr. Chromatogr. Comm., 1987, 10, 8, 461-463, https://doi.org/10.1002/jhrc.1240100809
. [all data]
Bredael, 1982
Bredael, P.,
Retention indices of hydrocarbons on SE-30,
J. Hi. Res. Chromatogr. Chromatogr. Comm., 1982, 5, 6, 325-328, https://doi.org/10.1002/jhrc.1240050610
. [all data]
White, Hackett, et al., 1992
White, C.M.; Hackett, J.; Anderson, R.R.; Kail, S.; Spock, P.S.,
Linear temperature programmed retention indices of gasoline range hydrocarbons and chlorinated hydrocarbons on cross-linked polydimethylsiloxane,
J. Hi. Res. Chromatogr., 1992, 15, 2, 105-120, https://doi.org/10.1002/jhrc.1240150211
. [all data]
Waggott and Davies, 1984
Waggott, A.; Davies, I.W.,
Identification of organic pollutants using linear temperature programmed retention indices (LTPRIs) - Part II, 1984, retrieved from http://dwi.defra.gov.uk/research/completed-research/reports/dwi0383.pdf. [all data]