1-Butene, 3,4-dichloro-
- Formula: C4H6Cl2
- Molecular weight: 124.996
- IUPAC Standard InChIKey: XVEASTGLHPVZNA-UHFFFAOYSA-N
- CAS Registry Number: 760-23-6
- Chemical structure:
View 3d structure (requires JavaScript / HTML 5) - Species with the same structure:
- Other names: 1,2-Dichloro-3-butene; 3,4-Dichloro-1-butene; 1,2-Dichlorobut-3-ene; 3,4-dichlorobut-1-ene

Phase change data

Data compiled as indicated in comments:
BS - Robert L. Brown and Stephen E. Stein
TRC - Thermodynamics Research Center, NIST Boulder Laboratories, Chris Muzny director
AC - William E. Acree, Jr., James S. Chickos
Quantity | Value | Units | Method | Reference | Comment |
---|---|---|---|---|---|
Tboil | 396.2 | K | N/A | Aldrich Chemical Company Inc., 1990 | BS |
Tboil | 427. | K | N/A | Anonymous, 1968 | Uncertainty assigned by TRC = 3. K; source of data not stated; TRC |
Quantity | Value | Units | Method | Reference | Comment |
Tfus | 212. | K | N/A | Anonymous, 1968 | Uncertainty assigned by TRC = 5. K; source of data not stated; TRC |
Enthalpy of vaporization
ΔvapH (kJ/mol) | Temperature (K) | Method | Reference | Comment |
---|---|---|---|---|
38. | 335. | A | Stephenson and Malanowski, 1987 | Based on data from 320. to 396. K.; AC |

Reaction thermochemistry data

Data compiled by: Hussein Y. Afeefy, Joel F. Liebman, and Stephen E. Stein
Individual Reactions
By formula: C4H6Cl2 = C4H6Cl2
Quantity | Value | Units | Method | Reference | Comment |
---|---|---|---|---|---|
ΔrH° | 2. | kJ/mol | Eqk | Levanova, Yanshevskaya, et al., 1986 | liquid phase; solvent: Naphtha |
By formula: C4H6Cl2 = C4H6Cl2
Quantity | Value | Units | Method | Reference | Comment |
---|---|---|---|---|---|
ΔrH° | 6.3 | kJ/mol | Eqk | Levanova, Yanshevskaya, et al., 1986 | liquid phase; solvent: Naphta |

Van Den Dool and Kratz RI, non-polar column, temperature ramp

Column type | Active phase | I | Reference | Comment |
---|---|---|---|---|
Capillary | Petrocol DH | 763. | White, Hackett, et al., 1992 | 100. m/0.25 mm/0.5 μm, He, 1. K/min; Tstart: 30. C; Tend: 220. C |

Normal alkane RI, non-polar column, custom temperature program

Column type | Active phase | I | Reference | Comment |
---|---|---|---|---|
Capillary | OV-1, SE-30, Methyl silicone, SP-2100, OV-101, DB-1, etc. | 769. | Waggott and Davies, 1984 | Hydrogen; Column length: 50. m; Column diameter: 0.32 mm; Program: not specified |

References

Aldrich Chemical Company Inc., 1990
Aldrich Chemical Company Inc.,
Catalog Handbook of Fine Chemicals, Aldrich Chemical Company, Inc., Milwaukee WI, 1990, 1. [all data]
Anonymous, 1968
Anonymous, R.,
Properties of hydrocarbon of high molecular weight, Am. Pet. Inst. Res. Proj. 42, Penn. State Univ., 1968. [all data]
Stephenson and Malanowski, 1987
Stephenson, Richard M.; Malanowski, Stanislaw,
Handbook of the Thermodynamics of Organic Compounds, 1987, https://doi.org/10.1007/978-94-009-3173-2
. [all data]
Levanova, Yanshevskaya, et al., 1986
Levanova, S.V.; Yanshevskaya, I.V.; Asatryan, E.M.; Saakyan, N.L.; Kostand'yan, V.A.; Malkhasyan, A.Ts.; Martirosyan, G.T.,
Relationships of isomerization of the allylic type,
J. Appl. Chem. USSR, 1986, 59, 790-793. [all data]