2,6-octadiene-4,5-dione, 2,7-dimethyl-
- Formula: C10H14O2
- Molecular weight: 166.2170
- IUPAC Standard InChIKey: KLNTZSJKHSZQBH-UHFFFAOYSA-N
- CAS Registry Number: 760-12-3
- Chemical structure:
View 3d structure (requires JavaScript / HTML 5) - Permanent link for this species. Use this link for bookmarking this species for future reference.

Phase change data

Data compiled by: Thermodynamics Research Center, NIST Boulder Laboratories, Chris Muzny director
Quantity | Value | Units | Method | Reference | Comment |
---|---|---|---|---|---|
Tboil | 337.85 | K | N/A | Boord, Greenlee, et al., 1946 | Uncertainty assigned by TRC = 0.2 K |
Quantity | Value | Units | Method | Reference | Comment |
Tfus | 141.07 | K | N/A | Boord, Greenlee, et al., 1946 | Uncertainty assigned by TRC = 0.3 K |

References

Boord, Greenlee, et al., 1946
Boord, C.E.; Greenlee, K.W.; Perilstein, W.L.,
The Synthesis, Purification and Prop. of Hydrocarbons of Low Mol. Weight, Am. Pet. Inst. Res. Proj. 45, Eighth Annu. Rep., Ohio State Univ., June 30, 1946. [all data]