9-Tert-butyl-9,10-(dewar anthracene)
- Formula: C18H18
- Molecular weight: 234.3355
- IUPAC Standard InChIKey: ISMYYTMVFOAZIS-UHFFFAOYSA-N
- CAS Registry Number: 76008-29-2
- Chemical structure:
View 3d structure (requires JavaScript / HTML 5) - Permanent link for this species. Use this link for bookmarking this species for future reference.

Reaction thermochemistry data

Data compiled by: Hussein Y. Afeefy, Joel F. Liebman, and Stephen E. Stein
Individual Reactions
By formula: C18H18 = C18H18
Quantity | Value | Units | Method | Reference | Comment |
---|---|---|---|---|---|
ΔrH° | -172.3 ± 5.7 | kJ/mol | Eqk | Dreeskamp, Kapahnke, et al., 1988 | liquid phase; solvent: Decalin; Isomerization |
ΔrH° | 150. ± 8. | kJ/mol | Ciso | Kraljic, Mintas, et al., 1983 | liquid phase; solvent: Hexane |
By formula: C18H18 = C18H18
Quantity | Value | Units | Method | Reference | Comment |
---|---|---|---|---|---|
ΔrH° | -172.3 ± 5.7 | kJ/mol | Ciso | Jahn and Dreeskamp, 1982 | liquid phase; solvent: Decalin |

References

Dreeskamp, Kapahnke, et al., 1988
Dreeskamp, H.; Kapahnke, P.; Tochtermann, W.,
Photo valence isomerization of sterically strained aromatic hydrocarbons: 8,9-dicarbethoxy[6]paracyclophane,
Radiat. Phys. Chem., 1988, 32, 537-539. [all data]
Kraljic, Mintas, et al., 1983
Kraljic, I.; Mintas, M.; Klasinc, L.; Ranogajec, F.; Guesten, H.,
Thermo- and photochemical aspects of the valence isomerization of 9-tert-butylanthracene,
Nouv. J. Chim., 1983, 7, 239-243. [all data]
Jahn and Dreeskamp, 1982
Jahn, B.; Dreeskamp, H.,
Valence isomerization of the 9,10-Dewar isomer to 9-tert-butylanthracene,
Z. Naturforsch. A, 1982, 37, 376-379. [all data]