Propanoic acid, 2,2-dichloro-
- Formula: C3H4Cl2O2
- Molecular weight: 142.969
- IUPAC Standard InChIKey: NDUPDOJHUQKPAG-UHFFFAOYSA-N
- CAS Registry Number: 75-99-0
- Chemical structure:
View 3d structure (requires JavaScript / HTML 5) - Other names: Propionic acid, 2,2-dichloro-; α,α-Dichloropropionic acid; Alatex; Basinex P; D-Granulat; Dalapon; Dawpon-RAE; Dowpon M; DPA; Sys-Omnidel; 2,2-Dichloropropionic acid; 2,2-DPA; α-Dichloropropionic acid; Kenapon; Liropon; Proprop; Unipon; 2,2-Dichloropropanoic acid; Basfapon B; Basfapon N; BH Dalapon; Crisapon; Dalapon 85; Kyselina 2,2-dichlorpropionova; Revenge; Dalapon-acid; Basfapon/N; Davpon; Dowpon proprop; S95; Uropon; Dalascam; NSC 56352; S 1315; S 95 (herbicide); Tripon

Phase change data

Data compiled by: Robert L. Brown and Stephen E. Stein
Quantity | Value | Units | Method | Reference | Comment |
---|---|---|---|---|---|
Tboil | 460.7 | K | N/A | Weast and Grasselli, 1989 |
Reduced pressure boiling point
Tboil (K) | Pressure (bar) | Reference |
---|---|---|
364.2 | 0.019 | Weast and Grasselli, 1989 |
371. to 373. | 0.024 | Frinton Laboratories Inc., 1986 |

References

Weast and Grasselli, 1989
CRC Handbook of Data on Organic Compounds, 2nd Editon, Weast,R.C and Grasselli, J.G., ed(s)., CRC Press, Inc., Boca Raton, FL, 1989, 1. [all data]
Frinton Laboratories Inc., 1986
Frinton Laboratories Inc.,
Catalog Number 11, Frinton Laboratories Inc., Vineland, NJ, 1986, 99. [all data]