2-(i-C3H7)-pyridine
- Formula: C8H11N
- Molecular weight: 121.1796
- IUPAC Standard InChIKey: PFYPDUUXDADWKC-UHFFFAOYSA-N
- CAS Registry Number: 75981-47-4
- Chemical structure:

Gas phase ion energetics data

Data evaluated by: Edward P. Hunter and Sharon G. Lias
Quantity | Value | Units | Method | Reference | Comment |
---|---|---|---|---|---|
Proton affinity (review) | 228.6 | kcal/mol | N/A | Hunter and Lias, 1998 | |
Quantity | Value | Units | Method | Reference | Comment |
Gas basicity | 221.0 | kcal/mol | N/A | Hunter and Lias, 1998 |

References

Hunter and Lias, 1998
Hunter, E.P.; Lias, S.G.,
Evaluated Gas Phase Basicities and Proton Affinities of Molecules: An Update,
J. Phys. Chem. Ref. Data, 1998, 27, 3, 413-656, https://doi.org/10.1063/1.556018
. [all data]