7-Methylenebicyclo[3.2.0]hept-1-ene

Reaction thermochemistry data

Data compiled by: Hussein Y. Afeefy, Joel F. Liebman, and Stephen E. Stein

Individual Reactions

2Hydrogen + 7-Methylenebicyclo[3.2.0]hept-1-ene = Bicyclo[3.2.0]heptane, 6-methyl-, (1α, 5α, 6α)-

By formula: 2H2 + C8H10 = C8H14

Quantity Value Units Method Reference Comment
Δr-68.3 ± 0.1kcal/molChydRoth, Ruhkamp, et al., 1991gas phase; The ratio 21.9:78.1 % anti to syn isomers

References

Roth, Ruhkamp, et al., 1991
Roth, W.R.; Ruhkamp, J.; Lennartz, H.-W., Bestimmung der Singulett-Triplett-Aufspaltung von Diradikalen mit Hilfe der Sauerstoff-Abfang-Technik, Chem. Ber., 1991, 124, 2047-2051. [all data]