Diethyl tert-butylmalonate
- Formula: C11H20O4
- Molecular weight: 216.2741
- IUPAC Standard InChIKey: RJNICNBRGVKNSR-UHFFFAOYSA-N
- CAS Registry Number: 759-24-0
- Chemical structure:
View 3d structure (requires JavaScript / HTML 5) - Other names: Diethyl t-butylmalonate; Propanedioic acid, (1,1-dimethylethyl)-, diethyl ester; diethyl (1,1-dimethylethyl)malonate

Phase change data

Data compiled by: Robert L. Brown and Stephen E. Stein
Reduced pressure boiling point
Tboil (K) | Pressure (bar) | Reference |
---|---|---|
376.2 | 0.015 | Aldrich Chemical Company Inc., 1990 |

Reaction thermochemistry data

Data compiled by: John E. Bartmess
Individual Reactions
C11H19O4- + =
By formula: C11H19O4- + H+ = C11H20O4
Quantity | Value | Units | Method | Reference | Comment |
---|---|---|---|---|---|
ΔrG° | 1441. ± 8.4 | kJ/mol | IMRE | Taft and Bordwell, 1988 | gas phase |

Gas phase ion energetics data

Data compiled by: John E. Bartmess
De-protonation reactions
C11H19O4- + =
By formula: C11H19O4- + H+ = C11H20O4
Quantity | Value | Units | Method | Reference | Comment |
---|---|---|---|---|---|
ΔrG° | 1441. ± 8.4 | kJ/mol | IMRE | Taft and Bordwell, 1988 | gas phase |

References

Aldrich Chemical Company Inc., 1990
Aldrich Chemical Company Inc.,
Catalog Handbook of Fine Chemicals, Aldrich Chemical Company, Inc., Milwaukee WI, 1990, 1. [all data]
Taft and Bordwell, 1988
Taft, R.W.; Bordwell, F.G.,
Structural and Solvent Effects Evaluated from Acidities Measured in Dimethyl Sulfoxide and in the Gas Phase,
Acc. Chem. Res., 1988, 21, 12, 463, https://doi.org/10.1021/ar00156a005
. [all data]