Ethanamine, N,N-difluoro-
- Formula: C2H5F2N
- Molecular weight: 81.0646
- IUPAC Standard InChIKey: IAUJKTVVMRFADH-UHFFFAOYSA-N
- CAS Registry Number: 758-18-9
- Chemical structure:

Phase change data

Data compiled by: William E. Acree, Jr., James S. Chickos
Enthalpy of vaporization
ΔvapH (kJ/mol) | Temperature (K) | Method | Reference | Comment |
---|---|---|---|---|
27.3 | 250. | A | Stephenson and Malanowski, 1987 | Based on data from 241. to 259. K. |
25.7 | 288. | N/A | Frazer, 1960 |

References

Stephenson and Malanowski, 1987
Stephenson, Richard M.; Malanowski, Stanislaw,
Handbook of the Thermodynamics of Organic Compounds, 1987, https://doi.org/10.1007/978-94-009-3173-2
. [all data]
Frazer, 1960
Frazer, J.W.,
Preparation of N,N-difluoromethylamine and N,N-difluoroethylamine,
Journal of Inorganic and Nuclear Chemistry, 1960, 16, 1-2, 63-66, https://doi.org/10.1016/0022-1902(60)80088-7
. [all data]