2-(3-hydroxy-2-quinolyl)-1H-indene-1,3(2H)-dione

Phase change data

Data compiled by: William E. Acree, Jr., James S. Chickos

Enthalpy of sublimation

ΔsubH (kcal/mol) Temperature (K) Reference Comment
33.2498.MCDOWELL, 2008Based on data from 483. - 513. K.

Enthalpy of fusion

ΔfusH (kcal/mol) Temperature (K) Reference
7.383539.2Baughman and Weber, 1991

References

MCDOWELL, 2008
MCDOWELL, WILLIAM, The Behaviour of Disperse Dyes at High Temperatures, J Food Science, 2008, 89, 5, 177-185, https://doi.org/10.1111/j.1478-4408.1973.tb03146.x . [all data]

Baughman and Weber, 1991
Baughman, George L.; Weber, Eric J., Estimation of water solubility and octanol/water partition coefficient of hydrophobie dyes, Dyes and Pigments, 1991, 16, 4, 261-271, https://doi.org/10.1016/0143-7208(91)85016-2 . [all data]