Naphthalene, 1-(phenylthio)-
- Formula: C16H12S
- Molecular weight: 236.331
- IUPAC Standard InChIKey: UUZCTKYYDFEULY-UHFFFAOYSA-N
- CAS Registry Number: 7570-98-1
- Chemical structure:
View 3d structure (requires JavaScript / HTML 5) - Other names: Sulfide, 1-naphthyl phenyl; 1-(Phenylthio)naphthalene; 1-(Phenylsulfanyl)naphthalene; 1-Phenylnaphthylsulfide

Lee's RI, non-polar column, custom temperature program

Column type | Active phase | I | Reference | Comment |
---|---|---|---|---|
Capillary | HP-5 | 372.71 | Reckendorf, 1997 | 25. m/0.2 mm/0.11 μm, He; Program: 106C(0.2min) => 40C/min => 120C => 3C/min => 310C(10min) |

References

Reckendorf, 1997
Reckendorf, R.M.,
Identification of phenyl-substituted polycyclic aromatic compounds in ring furnace gases using GC-MS and GC-AED,
Chromatographia, 1997, 45, 1, 173-182, https://doi.org/10.1007/BF02505557
. [all data]