2-Phenylnaphthylsulfide
- Formula: C16H12S
- Molecular weight: 236.331
- IUPAC Standard InChIKey: APWYHOPXAIRDIZ-UHFFFAOYSA-N
- CAS Registry Number: 7570-96-9
- Chemical structure:
View 3d structure (requires JavaScript / HTML 5) - Permanent link for this species. Use this link for bookmarking this species for future reference.

Lee's RI, non-polar column, custom temperature program

Column type | Active phase | I | Reference | Comment |
---|---|---|---|---|
Capillary | HP-5 | 364.94 | Reckendorf, 1997 | 25. m/0.2 mm/0.11 μm, He; Program: 106C(0.2min) => 40C/min => 120C => 3C/min => 310C(10min) |

References

Reckendorf, 1997
Reckendorf, R.M.,
Identification of phenyl-substituted polycyclic aromatic compounds in ring furnace gases using GC-MS and GC-AED,
Chromatographia, 1997, 45, 1, 173-182, https://doi.org/10.1007/BF02505557
. [all data]