Cyclohexanamine, N-cyclohexyl-N-methyl-
- Formula: C13H25N
- Molecular weight: 195.3443
- IUPAC Standard InChIKey: GSCCALZHGUWNJW-UHFFFAOYSA-N
- CAS Registry Number: 7560-83-0
- Chemical structure:
View 3d structure (requires JavaScript / HTML 5) - Other names: Dicyclohexylamine, N-methyl-; N-Methyldicyclohexylamine; N,N-Dicyclohexylmethylamine; Dicyclohexylmethylamine; N-cyclohexyl-N-methylcyclohexylamine

Phase change data

Data compiled by: Robert L. Brown and Stephen E. Stein
Quantity | Value | Units | Method | Reference | Comment |
---|---|---|---|---|---|
Tboil | 538.2 | K | N/A | Aldrich Chemical Company Inc., 1990 |
Reduced pressure boiling point
Tboil (K) | Pressure (bar) | Reference |
---|---|---|
388. to 391. | 0.013 | Frinton Laboratories Inc., 1986 |

References

Aldrich Chemical Company Inc., 1990
Aldrich Chemical Company Inc.,
Catalog Handbook of Fine Chemicals, Aldrich Chemical Company, Inc., Milwaukee WI, 1990, 1. [all data]
Frinton Laboratories Inc., 1986
Frinton Laboratories Inc.,
Catalog Number 11, Frinton Laboratories Inc., Vineland, NJ, 1986, 99. [all data]