2-Propenoic acid, 3-(3,4,5-trimethoxyphenyl)-, methyl ester
- Formula: C13H16O5
- Molecular weight: 252.2631
- IUPAC Standard InChIKey: KLXHCGFNNUQTEY-AATRIKPKSA-N
- CAS Registry Number: 7560-49-8
- Chemical structure:
View 3d structure (requires JavaScript / HTML 5) - Species with the same structure:
- Stereoisomers:
- Other names: Cinnamic acid, 3,4,5-trimethoxy-, methyl ester; Methyl 3,4,5-trimethoxycinnamate; Methyl ester of 3,4,5-Trimethoxycinnamic acid; Sinapic acid, O,O'-dimethyl-; Methyl (2E)-3-(3,4,5-trimethoxyphenyl)-2-propenoate; 2-Propenoic acid, 3-(3,4,5-trimethoxyphenyl)-, methyl ester, trans

Van Den Dool and Kratz RI, non-polar column, temperature ramp

Column type | Active phase | I | Reference | Comment |
---|---|---|---|---|
Capillary | VF-5MS | 2030. | Todua, 2011 | 30. m/0.25 mm/0.25 μm, He; Tstart: 60. C; Tend: 270. C |

Normal alkane RI, non-polar column, custom temperature program

Column type | Active phase | I | Reference | Comment |
---|---|---|---|---|
Capillary | DB-1 | 1966. | Marlatt, Ho, et al., 1992 | 30. m/0.25 mm/0.25 μm; Program: not specified |

References

Todua, 2011
Todua, N.G.,
Retention Data. NIST Mass Spectrometry Data Center., NIST Mass Spectrometry Data Center, 2011. [all data]
Marlatt, Ho, et al., 1992
Marlatt, C.; Ho, C.-T.; Chien, M.,
Studies of aroma constituents bound as glycosides in tomato,
J. Agric. Food Chem., 1992, 40, 2, 249-252, https://doi.org/10.1021/jf00014a016
. [all data]