Acetic acid, trifluoro-, 2,2-dimethylpropyl ester
- Formula: C7H11F3O2
- Molecular weight: 184.1562
- IUPAC Standard InChIKey: FWFLFZDXCNIPGS-UHFFFAOYSA-N
- CAS Registry Number: 7556-79-8
- Chemical structure:
View 3d structure (requires JavaScript / HTML 5) - Other names: Trifluoroacetic acid, 2,2-dimethylpropyl ester

Reaction thermochemistry data

Data compiled by: Hussein Y. Afeefy, Joel F. Liebman, and Stephen E. Stein
Individual Reactions
By formula: C4F6O3 + C5H12O = C7H11F3O2 + C2HF3O2
Quantity | Value | Units | Method | Reference | Comment |
---|---|---|---|---|---|
ΔrH° | -88.53 ± 0.08 | kJ/mol | Cm | Wiberg and Hao, 1991 | liquid phase; Trifuoroacetolysis |
By formula: C5H10 + C2HF3O2 = C7H11F3O2
Quantity | Value | Units | Method | Reference | Comment |
---|---|---|---|---|---|
ΔrH° | -45.7 ± 0.2 | kJ/mol | Cm | Wiberg and Hao, 1991 | liquid phase; Trifuoroacetolysis |
By formula: C5H10 + C2HF3O2 = C7H11F3O2
Quantity | Value | Units | Method | Reference | Comment |
---|---|---|---|---|---|
ΔrH° | -38.1 ± 0.2 | kJ/mol | Cm | Wiberg and Hao, 1991 | liquid phase; Trifluoroacetolysis |

References

Wiberg and Hao, 1991
Wiberg, K.B.; Hao, S.,
Enthalpies of hydration of alkenes. 4. Formation of acyclic tert-alcohols,
J. Org. Chem., 1991, 56, 5108-5110. [all data]