Silane, dichloromethyl-
- Formula: CH4Cl2Si
- Molecular weight: 115.034
- IUPAC Standard InChIKey: NWKBSEBOBPHMKL-UHFFFAOYSA-N
- CAS Registry Number: 75-54-7
- Chemical structure:
View 3d structure (requires JavaScript / HTML 5) - Species with the same structure:
- Other names: Dichloromethylsilane; Methyldichlorosilan; Silane, methyldichloro-; Methyldichlorosilane; Methyl-dichlorsilan; UN 1242; Dichlorohydridomethylsilicon; Monomethyldichlorosilane

Phase change data

Data compiled as indicated in comments:
BS - Robert L. Brown and Stephen E. Stein
AC - William E. Acree, Jr., James S. Chickos
Quantity | Value | Units | Method | Reference | Comment |
---|---|---|---|---|---|
Tboil | 314. | K | N/A | PCR Inc., 1990 | BS |
Enthalpy of vaporization
ΔvapH (kcal/mol) | Temperature (K) | Method | Reference | Comment |
---|---|---|---|---|
6.76 | 290. | I | Jenkins and Chambers, 1954 | Based on data from 275. to 314. K.; AC |
Antoine Equation Parameters
log10(P) = A − (B / (T + C))
P = vapor pressure (atm)
T = temperature (K)
View plot Requires a JavaScript / HTML 5 canvas capable browser.
Temperature (K) | A | B | C | Reference |
---|---|---|---|---|
274.7 to 313.9 | 4.16761 | 1179. | -31. | Jenkins and Chambers, 1954 |

Kovats' RI, non-polar column, isothermal

Column type | Active phase | Temperature (C) | I | Reference | Comment |
---|---|---|---|---|---|
Packed | Polymethylsiloxane, (PMS-20000) | 50. | 506.6 | Ainshtein and Shulyatieva, 1972 | He, Chromosorb W; Column length: 2. m |
Packed | SE-30 | 40. | 508. | Garzó, Fekete, et al., 1967 | N2, Chromosorb W; Column length: 2. m |

References

PCR Inc., 1990
PCR Inc.,
Research Chemicals Catalog 1990-1991, PCR Inc., Gainesville, FL, 1990, 1. [all data]
Jenkins and Chambers, 1954
Jenkins, Arthur C.; Chambers, George F.,
Vapor Pressures of Silicon Compounds,
Ind. Eng. Chem., 1954, 46, 11, 2367-2369, https://doi.org/10.1021/ie50539a043
. [all data]