Propanamide, 2,2-dimethyl-
- Formula: C5H11NO
- Molecular weight: 101.1469
- IUPAC Standard InChIKey: XIPFMBOWZXULIA-UHFFFAOYSA-N
- CAS Registry Number: 754-10-9
- Chemical structure:
View 3d structure (requires JavaScript / HTML 5) - Other names: Pivalamide; Trimethylacetamide

Gas phase thermochemistry data

Data compiled by: Hussein Y. Afeefy, Joel F. Liebman, and Stephen E. Stein
Quantity | Value | Units | Method | Reference | Comment |
---|---|---|---|---|---|
ΔfH°gas | -313.1 ± 1.4 | kJ/mol | Ccr | Abboud, Jimenez, et al., 1989 |

Condensed phase thermochemistry data

Data compiled as indicated in comments:
DH - Eugene S. Domalski and Elizabeth D. Hearing
ALS - Hussein Y. Afeefy, Joel F. Liebman, and Stephen E. Stein
Quantity | Value | Units | Method | Reference | Comment |
---|---|---|---|---|---|
ΔfH°solid | -399.7 ± 1.3 | kJ/mol | Ccr | Abboud, Jimenez, et al., 1989 | ALS |
Quantity | Value | Units | Method | Reference | Comment |
ΔcH°solid | -3139.9 ± 1.2 | kJ/mol | Ccr | Abboud, Jimenez, et al., 1989 | ALS |
Constant pressure heat capacity of liquid
Cp,liquid (J/mol*K) | Temperature (K) | Reference | Comment |
---|---|---|---|
159.8 | 298.150 | Abboud, Jimenez, et al., 1989 | One temperature; Cp given as 1.58 J/g*K.; DH |

Gas phase ion energetics data

Data evaluated as indicated in comments:
HL - Edward P. Hunter and Sharon G. Lias
Data compiled as indicated in comments:
B - John E. Bartmess
MM - Michael M. Meot-Ner (Mautner)
Quantity | Value | Units | Method | Reference | Comment |
---|---|---|---|---|---|
Proton affinity (review) | 889.0 | kJ/mol | N/A | Hunter and Lias, 1998 | HL |
Quantity | Value | Units | Method | Reference | Comment |
Gas basicity | 857.2 | kJ/mol | N/A | Hunter and Lias, 1998 | HL |
Gas basicity at 298K
Gas basicity (review) (kJ/mol) | Reference | Comment |
---|---|---|
855. ± 6. | Witt and Grutzmacher, 1997 | aniline; ortho-toluidine. Data readjusted to Hunter and Lias, 1998; MM |
858. ± 7. | Witt and Grutzmacher, 1997 | MM |
De-protonation reactions
C5H10NO- + =
By formula: C5H10NO- + H+ = C5H11NO
Quantity | Value | Units | Method | Reference | Comment |
---|---|---|---|---|---|
ΔrH° | 1498. ± 8.8 | kJ/mol | G+TS | Taft, 1987 | gas phase; value altered from reference due to change in acidity scale; B |
Quantity | Value | Units | Method | Reference | Comment |
ΔrG° | 1469. ± 8.4 | kJ/mol | IMRE | Taft, 1987 | gas phase; value altered from reference due to change in acidity scale; B |

Reaction thermochemistry data

Data compiled by: John E. Bartmess
Individual Reactions
C5H10NO- + =
By formula: C5H10NO- + H+ = C5H11NO
Quantity | Value | Units | Method | Reference | Comment |
---|---|---|---|---|---|
ΔrH° | 1498. ± 8.8 | kJ/mol | G+TS | Taft, 1987 | gas phase; value altered from reference due to change in acidity scale |
Quantity | Value | Units | Method | Reference | Comment |
ΔrG° | 1469. ± 8.4 | kJ/mol | IMRE | Taft, 1987 | gas phase; value altered from reference due to change in acidity scale |

Phase change data

Data compiled as indicated in comments:
BS - Robert L. Brown and Stephen E. Stein
AC - William E. Acree, Jr., James S. Chickos
ALS - Hussein Y. Afeefy, Joel F. Liebman, and Stephen E. Stein
DH - Eugene S. Domalski and Elizabeth D. Hearing
Quantity | Value | Units | Method | Reference | Comment |
---|---|---|---|---|---|
Tboil | 485.2 | K | N/A | Aldrich Chemical Company Inc., 1990 | BS |
Quantity | Value | Units | Method | Reference | Comment |
ΔsubH° | 21. ± 0.48 | kcal/mol | TE | Brunetti, Gatta, et al., 2000 | Based on data from 298. to 359. K.; AC |
ΔsubH° | 20.7 ± 0.1 | kcal/mol | C | Abboud, Jimenez, et al., 1989 | ALS |
ΔsubH° | 20.7 ± 0.1 | kcal/mol | N/A | Abboud, Jimenez, et al., 1989 | Based on data from 288. to 306. K.; AC |
Enthalpy of sublimation
ΔsubH (kcal/mol) | Temperature (K) | Reference | Comment |
---|---|---|---|
20.698 | 298.15 | Abboud, Jimenez, et al., 1989 | DH |
Entropy of sublimation
ΔsubS (cal/mol*K) | Temperature (K) | Reference | Comment |
---|---|---|---|
69.43 | 298.15 | Abboud, Jimenez, et al., 1989 | DH |
Enthalpy of fusion
ΔfusH (kcal/mol) | Temperature (K) | Reference | Comment |
---|---|---|---|
5.76 | 425.4 | Abate, Badea, et al., 2008 | AC |

References

Abboud, Jimenez, et al., 1989
Abboud, J.-L.M.; Jimenez, P.; Roux, M.V.; Turrion, C.; Lopez-Mardomingo, C.,
Structural effects on the thermochemical properties of carbonyl compounds. I. Enthalpies of combustion, vapour pressures and enthalpies of sublimation, and enthalpies of formation of 2-methylpropanamide, 2,2-dimethylpropanamide, and 1-adamantyl carboxamide,
J. Chem. Thermodyn., 1989, 21, 859-865. [all data]
Hunter and Lias, 1998
Hunter, E.P.; Lias, S.G.,
Evaluated Gas Phase Basicities and Proton Affinities of Molecules: An Update,
J. Phys. Chem. Ref. Data, 1998, 27, 3, 413-656, https://doi.org/10.1063/1.556018
. [all data]
Witt and Grutzmacher, 1997
Witt, M.; Grutzmacher, H.F.,
Proton-bound dimers of aliphatic carboxamides: gas-phase basicity and dissociation energy,
Int. J. Mass Spectrom. Ion Processes, 1997, 165, 49. [all data]
Taft, 1987
Taft, R.W.,
The Nature and Analysis of Substitutent Electronic Effects,
Personal communication. See also Prog. Phys. Org. Chem., 1987, 16, 1. [all data]