Dimethyl sulfide
- Formula: C2H6S
- Molecular weight: 62.134
- IUPAC Standard InChIKey: QMMFVYPAHWMCMS-UHFFFAOYSA-N
- CAS Registry Number: 75-18-3
- Chemical structure:
View 3d structure (requires JavaScript / HTML 5) - Isotopologues:
- Other names: Methane, thiobis-; Methyl sulfide; Dimethyl monosulfide; Dimethyl thioether; DMS; Methyl monosulfide; 2-Thiapropane; Dimethyl sulphide; Thiobismethane; (CH3)2S; Dimethylsulfid; Exact-S; Methyl sulphide; Methylthiomethane; Sulfure de methyle; 2-Thiopropane; UN 1164; Methyl thioether; Sulfide, methyl-; Methane, 1,1'-thiobis-; (Methylsulfanyl)methane

Gas phase thermochemistry data

Data compiled as indicated in comments:
ALS - Hussein Y. Afeefy, Joel F. Liebman, and Stephen E. Stein
DRB - Donald R. Burgess, Jr.
Quantity | Value | Units | Method | Reference | Comment |
---|---|---|---|---|---|
ΔfH°gas | -37.5 ± 2.0 | kJ/mol | Ccb | Voronkov, Klyuchnikov, et al., 1989 | ALS |
ΔfH°gas | -37.6 ± 0.59 | kJ/mol | Ccr | McCullough, Hubbard, et al., 1957 | ALS |
ΔfH°gas | -32.4 | kJ/mol | N/A | Douglas, 1946 | Value computed using ΔfHliquid° value of -60.2 kj/mol from Douglas, 1946 and ΔvapH° value of 27.8 kj/mol from McCullough, Hubbard, et al., 1957.; DRB |

Condensed phase thermochemistry data

Data compiled by: Hussein Y. Afeefy, Joel F. Liebman, and Stephen E. Stein
Quantity | Value | Units | Method | Reference | Comment |
---|---|---|---|---|---|
ΔfH°liquid | -65.4 ± 1.5 | kJ/mol | Ccb | Voronkov, Klyuchnikov, et al., 1989 | |
ΔfH°liquid | -65.44 ± 0.59 | kJ/mol | Ccr | McCullough, Hubbard, et al., 1957 | |
ΔfH°liquid | -60.2 | kJ/mol | Cm | Douglas, 1946 | At 291°K |
Quantity | Value | Units | Method | Reference | Comment |
ΔcH°liquid | -2181.5 ± 0.3 | kJ/mol | Ccr | McCullough, Hubbard, et al., 1957 | Reanalyzed by Cox and Pilcher, 1970, Original value = -2180.2 ± 0.3 kJ/mol |

Phase change data

Data compiled as indicated in comments:
BS - Robert L. Brown and Stephen E. Stein
TRC - Thermodynamics Research Center, NIST Boulder Laboratories, Chris Muzny director
AC - William E. Acree, Jr., James S. Chickos
ALS - Hussein Y. Afeefy, Joel F. Liebman, and Stephen E. Stein
DRB - Donald R. Burgess, Jr.
Quantity | Value | Units | Method | Reference | Comment |
---|---|---|---|---|---|
Tboil | 311. ± 3. | K | AVG | N/A | Average of 9 values; Individual data points |
Quantity | Value | Units | Method | Reference | Comment |
Tfus | 174.88 | K | N/A | Haines, Helm, et al., 1956 | Uncertainty assigned by TRC = 0.06 K; TRC |
Tfus | 174.90 | K | N/A | Mcallan, Cullum, et al., 1951 | Uncertainty assigned by TRC = 0.1 K; TRC |
Quantity | Value | Units | Method | Reference | Comment |
Ttriple | 174.85 | K | N/A | Osborne, Doescher, et al., 1942 | Uncertainty assigned by TRC = 0.03 K; TRC |
Quantity | Value | Units | Method | Reference | Comment |
Tc | 503. | K | N/A | Majer and Svoboda, 1985 | |
Tc | 503.0 | K | N/A | Berthoud and Brum, 1924 | Uncertainty assigned by TRC = 0.4 K; by disappearance of meniscus; TRC |
Tc | 503.0 | K | N/A | Berthoud and Brum, 1924 | Uncertainty assigned by TRC = 0.4 K; by apperanance of turbidity; TRC |
Quantity | Value | Units | Method | Reference | Comment |
Pc | 55.30 | bar | N/A | Berthoud and Brum, 1924 | Uncertainty assigned by TRC = 0.4053 bar; vapor pressure at Tc; TRC |
Quantity | Value | Units | Method | Reference | Comment |
ρc | 4.972 | mol/l | N/A | Berthoud and Brum, 1924 | Uncertainty assigned by TRC = 0.03 mol/l; TRC |
ρc | 4.84 | mol/l | N/A | Herz and Neukirch, 1923 | Uncertainty assigned by TRC = 0.03 mol/l; TRC |
Quantity | Value | Units | Method | Reference | Comment |
ΔvapH° | 27.8 ± 0.3 | kJ/mol | AVG | N/A | Average of 8 values; Individual data points |
Enthalpy of vaporization
ΔvapH (kJ/mol) | Temperature (K) | Method | Reference | Comment |
---|---|---|---|---|
27. | 310.5 | N/A | Majer and Svoboda, 1985 | |
28.9 | 283. | A | Stephenson and Malanowski, 1987 | Based on data from 268. to 319. K.; AC |
27.7 | 322. | A | Stephenson and Malanowski, 1987 | Based on data from 307. to 379. K.; AC |
26.6 | 387. | A | Stephenson and Malanowski, 1987 | Based on data from 372. to 453. K.; AC |
26.7 | 462. | A | Stephenson and Malanowski, 1987 | Based on data from 447. to 503. K.; AC |
28.8 ± 0.1 | 276. | C | McCullough, Hubbard, et al., 1957 | AC |
27.9 ± 0.1 | 292. | C | McCullough, Hubbard, et al., 1957 | AC |
27.0 ± 0.1 | 310. | C | McCullough, Hubbard, et al., 1957 | AC |
28.2 | 302. | EB | White, Barnard--Smith, et al., 1952 | Based on data from 287. to 318. K.; AC |
28.9 | 278. | N/A | Osborne, Doescher, et al., 1942, 2 | Based on data from 251. to 293. K.; AC |
28.9 | 310. | N/A | Thompson and Linnett, 1935 | AC |
Enthalpy of vaporization
ΔvapH =
A exp(-βTr) (1 − Tr)β
ΔvapH =
Enthalpy of vaporization (at saturation pressure)
(kJ/mol)
Tr = reduced temperature (T / Tc)
View plot Requires a JavaScript / HTML 5 canvas capable browser.
Temperature (K) | A (kJ/mol) | β | Tc (K) | Reference | Comment |
---|---|---|---|---|---|
276. to 311. | 41.54 | 0.2731 | 503. | Majer and Svoboda, 1985 |
Antoine Equation Parameters
log10(P) = A − (B / (T + C))
P = vapor pressure (bar)
T = temperature (K)
View plot Requires a JavaScript / HTML 5 canvas capable browser.
Temperature (K) | A | B | C | Reference | Comment |
---|---|---|---|---|---|
250.60 to 293.24 | 4.28713 | 1201.134 | -29.906 | Osborne, Doescher, et al., 1942, 2 | Coefficents calculated by NIST from author's data. |
Enthalpy of fusion
ΔfusH (kJ/mol) | Temperature (K) | Reference | Comment |
---|---|---|---|
7.98 | 174.9 | Domalski and Hearing, 1996 | AC |

Reaction thermochemistry data

Data compiled as indicated in comments:
B - John E. Bartmess
M - Michael M. Meot-Ner (Mautner) and Sharon G. Lias
ALS - Hussein Y. Afeefy, Joel F. Liebman, and Stephen E. Stein
RCD - Robert C. Dunbar
Individual Reactions
C2H5S- + =
By formula: C2H5S- + H+ = C2H6S
Quantity | Value | Units | Method | Reference | Comment |
---|---|---|---|---|---|
ΔrH° | 1633. ± 6.3 | kJ/mol | D-EA | Moran and Ellison, 1988 | gas phase; B |
ΔrH° | 1645. ± 8.8 | kJ/mol | G+TS | Ingemann and Nibbering, 1985 | gas phase; B |
Quantity | Value | Units | Method | Reference | Comment |
ΔrG° | 1602. ± 7.1 | kJ/mol | H-TS | Moran and Ellison, 1988 | gas phase; B |
ΔrG° | 1615. ± 8.4 | kJ/mol | IMRE | Ingemann and Nibbering, 1985 | gas phase; B |
By formula: C2H7S+ + C2H6S = (C2H7S+ • C2H6S)
Quantity | Value | Units | Method | Reference | Comment |
---|---|---|---|---|---|
ΔrH° | 110. | kJ/mol | PHPMS | Meot-Ner (Mautner) and Sieck, 1985 | gas phase; ΔrH?, inconsistent with other protonated sulfur dimers; M |
Quantity | Value | Units | Method | Reference | Comment |
ΔrS° | 119. | J/mol*K | PHPMS | Meot-Ner (Mautner) and Sieck, 1985 | gas phase; ΔrH?, inconsistent with other protonated sulfur dimers; M |
By formula: C2H6S+ + C2H6S = (C2H6S+ • C2H6S)
Bond type: Charge transfer bond (positive ion)
Quantity | Value | Units | Method | Reference | Comment |
---|---|---|---|---|---|
ΔrH° | 112. | kJ/mol | DT | Deng, Illies, et al., 1995 | gas phase; ΔrH(0K) = 115. kJ/mol; M |
Quantity | Value | Units | Method | Reference | Comment |
ΔrS° | 111. | J/mol*K | DT | Deng, Illies, et al., 1995 | gas phase; ΔrH(0K) = 115. kJ/mol; M |
By formula: C4H9+ + C2H6S = (C4H9+ • C2H6S)
Quantity | Value | Units | Method | Reference | Comment |
---|---|---|---|---|---|
ΔrH° | 185. | kJ/mol | PHPMS | Meot-Ner (Mautner) and Sieck, 1991 | gas phase; condensation; M |
Quantity | Value | Units | Method | Reference | Comment |
ΔrS° | 178. | J/mol*K | PHPMS | Meot-Ner (Mautner) and Sieck, 1991 | gas phase; condensation; M |
By formula: 2C2H6S + O2 = 2C2H6OS
Quantity | Value | Units | Method | Reference | Comment |
---|---|---|---|---|---|
ΔrH° | -277.7 ± 0.84 | kJ/mol | Cm | Douglas, 1946 | liquid phase; Reanalyzed by Cox and Pilcher, 1970, Original value = -278.3 ± 0.8 kJ/mol; At 291°K; ALS |
By formula: Li+ + C2H6S = (Li+ • C2H6S)
Quantity | Value | Units | Method | Reference | Comment |
---|---|---|---|---|---|
ΔrH° | 137. | kJ/mol | ICR | Staley and Beauchamp, 1975 | gas phase; switching reaction(Li+)H2O, from graph; Dzidic and Kebarle, 1970 extrapolated; M |
By formula: Na+ + C2H6S = (Na+ • C2H6S)
Free energy of reaction
ΔrG° (kJ/mol) | T (K) | Method | Reference | Comment |
---|---|---|---|---|
59.4 | 298. | IMRE | McMahon and Ohanessian, 2000 | Anchor alanine=39.89; RCD |
By formula: HI + C2H5IS = C2H6S + I2
Quantity | Value | Units | Method | Reference | Comment |
---|---|---|---|---|---|
ΔrH° | -28. ± 4.6 | kJ/mol | Kin | Shum and Benson, 1985 | gas phase; ALS |

Henry's Law data

Data compiled by: Rolf Sander
Henry's Law constant (water solution)
kH(T) = k°H exp(d(ln(kH))/d(1/T) ((1/T) - 1/(298.15 K)))
k°H = Henry's law constant for solubility in water at 298.15 K (mol/(kg*bar))
d(ln(kH))/d(1/T) = Temperature dependence constant (K)
k°H (mol/(kg*bar)) | d(ln(kH))/d(1/T) (K) | Method | Reference | Comment |
---|---|---|---|---|
0.48 | 3100. | M | N/A | |
0.080 | E | N/A | Calculated molecular structure relationship. | |
0.48 | 3500. | X | N/A | Value given here as quoted by missing citation. |
0.56 | 3500. | M | N/A | |
0.62 | X | N/A | Value given here as quoted by missing citation. | |
0.44 | C | N/A | missing citation refer to an unpublished manuscript; no details are available. Solubility in sea water. | |
0.56 | 3700. | M | N/A | |
0.61 | M | N/A | Value at T = 293. K. | |
0.70 | R | N/A | Value at T = 293. K. | |
0.16 | M | N/A | ||
0.55 | V | N/A |

Gas phase ion energetics data

Data evaluated as indicated in comments:
HL - Edward P. Hunter and Sharon G. Lias
L - Sharon G. Lias
Data compiled as indicated in comments:
B - John E. Bartmess
LBLHLM - Sharon G. Lias, John E. Bartmess, Joel F. Liebman, John L. Holmes, Rhoda D. Levin, and W. Gary Mallard
LLK - Sharon G. Lias, Rhoda D. Levin, and Sherif A. Kafafi
RDSH - Henry M. Rosenstock, Keith Draxl, Bruce W. Steiner, and John T. Herron
Quantity | Value | Units | Method | Reference | Comment |
---|---|---|---|---|---|
IE (evaluated) | 8.69 ± 0.02 | eV | N/A | N/A | L |
Quantity | Value | Units | Method | Reference | Comment |
Proton affinity (review) | 198.6 | kcal/mol | N/A | Hunter and Lias, 1998 | HL |
Quantity | Value | Units | Method | Reference | Comment |
Gas basicity | 191.5 | kcal/mol | N/A | Hunter and Lias, 1998 | HL |
Ionization energy determinations
Appearance energy determinations
De-protonation reactions
C2H5S- + =
By formula: C2H5S- + H+ = C2H6S
Quantity | Value | Units | Method | Reference | Comment |
---|---|---|---|---|---|
ΔrH° | 390.2 ± 1.5 | kcal/mol | D-EA | Moran and Ellison, 1988 | gas phase; B |
ΔrH° | 393.2 ± 2.1 | kcal/mol | G+TS | Ingemann and Nibbering, 1985 | gas phase; B |
Quantity | Value | Units | Method | Reference | Comment |
ΔrG° | 383.0 ± 1.7 | kcal/mol | H-TS | Moran and Ellison, 1988 | gas phase; B |
ΔrG° | 386.0 ± 2.0 | kcal/mol | IMRE | Ingemann and Nibbering, 1985 | gas phase; B |

Ion clustering data

Data compiled as indicated in comments:
M - Michael M. Meot-Ner (Mautner) and Sharon G. Lias
RCD - Robert C. Dunbar
Clustering reactions
By formula: C2H6S+ + C2H6S = (C2H6S+ • C2H6S)
Bond type: Charge transfer bond (positive ion)
Quantity | Value | Units | Method | Reference | Comment |
---|---|---|---|---|---|
ΔrH° | 26.8 | kcal/mol | DT | Deng, Illies, et al., 1995 | gas phase; ΔrH(0K) = 27.6 kcal/mol; M |
Quantity | Value | Units | Method | Reference | Comment |
ΔrS° | 26.5 | cal/mol*K | DT | Deng, Illies, et al., 1995 | gas phase; ΔrH(0K) = 27.6 kcal/mol; M |
By formula: C2H7S+ + C2H6S = (C2H7S+ • C2H6S)
Quantity | Value | Units | Method | Reference | Comment |
---|---|---|---|---|---|
ΔrH° | 26.4 | kcal/mol | PHPMS | Meot-Ner (Mautner) and Sieck, 1985 | gas phase; ΔrH?, inconsistent with other protonated sulfur dimers; M |
Quantity | Value | Units | Method | Reference | Comment |
ΔrS° | 28.4 | cal/mol*K | PHPMS | Meot-Ner (Mautner) and Sieck, 1985 | gas phase; ΔrH?, inconsistent with other protonated sulfur dimers; M |
By formula: C4H9+ + C2H6S = (C4H9+ • C2H6S)
Quantity | Value | Units | Method | Reference | Comment |
---|---|---|---|---|---|
ΔrH° | 44.2 | kcal/mol | PHPMS | Meot-Ner (Mautner) and Sieck, 1991 | gas phase; condensation; M |
Quantity | Value | Units | Method | Reference | Comment |
ΔrS° | 42.6 | cal/mol*K | PHPMS | Meot-Ner (Mautner) and Sieck, 1991 | gas phase; condensation; M |
By formula: Li+ + C2H6S = (Li+ • C2H6S)
Quantity | Value | Units | Method | Reference | Comment |
---|---|---|---|---|---|
ΔrH° | 32.8 | kcal/mol | ICR | Staley and Beauchamp, 1975 | gas phase; switching reaction(Li+)H2O, from graph; Dzidic and Kebarle, 1970 extrapolated; M |
By formula: Na+ + C2H6S = (Na+ • C2H6S)
Free energy of reaction
ΔrG° (kcal/mol) | T (K) | Method | Reference | Comment |
---|---|---|---|---|
14.2 | 298. | IMRE | McMahon and Ohanessian, 2000 | Anchor alanine=39.89; RCD |

Normal alkane RI, polar column, temperature ramp

Data compiled by: NIST Mass Spectrometry Data Center, William E. Wallace, director

Column type CapillaryCapillaryCapillaryCapillaryCapillary
Active phase DB-WaxDB-WaxDB-WaxDB-WaxCP-Wax 52CB
Column length (m) 30.30.30.30.60.
Carrier gas HeliumHeliumHeliumHeliumHe
Substrate
Column diameter (mm) 0.250.250.250.250.32
Phase thickness (μm) 0.250.250.250.250.5
Tstart (C) 60.60.60.60.40.
Tend (C) 200.200.200.200.220.
Heat rate (K/min) 8.8.8.8.4.
Initial hold (min) 3.3.3.3.8.
Final hold (min) 9.59.59.59.520.
I 755.755.757.772.751.
ReferenceRochat, Egger, et al., 2009Rochat, Egger, et al., 2009Rochat, Egger, et al., 2009Rochat, Egger, et al., 2009Povolo, Contarini, et al., 2007
Comment MSDC-RI MSDC-RI MSDC-RI MSDC-RI MSDC-RI
Column type CapillaryCapillaryCapillaryCapillaryCapillary
Active phase CP-Wax 52CBCP-Wax 52CBInnowaxTC-WaxSupelcowax-10
Column length (m) 60.60.50.60.60.
Carrier gas HeHeHeHeHe
Substrate
Column diameter (mm) 0.320.320.20.250.25
Phase thickness (μm) 0.50.50.50.50.25
Tstart (C) 40.40.60.40.35.
Tend (C) 220.220.250.230.200.
Heat rate (K/min) 4.4.2.3.4.
Initial hold (min) 8.8. 8.10.
Final hold (min) 20.20.60.
I 753.748.746.754.745.
ReferencePovolo, Contarini, et al., 2007Povolo, Contarini, et al., 2007Bendimerad and Bendiab, 2005Ishikawa, Ito, et al., 2004Girard and Durance, 2000
Comment MSDC-RI MSDC-RI MSDC-RI MSDC-RI MSDC-RI
Column type Capillary
Active phase DB-Wax
Column length (m) 60.
Carrier gas He
Substrate
Column diameter (mm) 0.25
Phase thickness (μm) 0.25
Tstart (C) 40.
Tend (C) 200.
Heat rate (K/min) 2.
Initial hold (min) 2.
Final hold (min)
I 748.
ReferenceUmano, Hagi, et al., 2000
Comment MSDC-RI

Normal alkane RI, polar column, custom temperature program

Data compiled by: NIST Mass Spectrometry Data Center, William E. Wallace, director

Column type CapillaryCapillaryCapillaryCapillaryCapillary
Active phase DB-FFAPDB-WaxSupelcowax-10DB-WaxSupelcowax 10
Column length (m) 30.30.50.30.50.
Carrier gas HeliumHeliumHeliumHeliumHelium
Substrate
Column diameter (mm) 0.250.250.250.320.25
Phase thickness (μm) 0.250.250.250.500.25
Program not specifiednot specified45 0C (15 min) 3 0C/min -> 75 0C 5 0C/min -> 180 0C (10 min)40 0C 7 0C/min -> 110 0C 15 0C/min -> 250 0C (3 min)45 0C (15 min) 3 0C/min -> 75 0C 5 0C/min -> 180 0C (10 min)
I 716.746.740.753.740.
ReferenceMebazaa, Mahmoudi, et al., 2009Rochat, Egger, et al., 2009Soria, Martinez-Castro, et al., 2009Valappil, Fan, et al., 2009Soria, Martinez-Castro, et al., 2008
Comment MSDC-RI MSDC-RI MSDC-RI MSDC-RI MSDC-RI
Column type CapillaryCapillary
Active phase DB-WaxSupelcowax-10
Column length (m) 60.60.
Carrier gas HeliumHe
Substrate
Column diameter (mm) 0.250.53
Phase thickness (μm) 0.251.
Program 60 0C (3 min) 2 0C/min -> 150 0C 4 0C/min -> 200 0C40C (2min) => 16C/min => 120C => 15C/min => 240C(3min)
I 757.793.
ReferenceKim. J.H., Ahn, et al., 2004Forney and Jordan, 1998
Comment MSDC-RI MSDC-RI

Normal alkane RI, non-polar column, custom temperature program

Data compiled by: NIST Mass Spectrometry Data Center, William E. Wallace, director

Column type CapillaryCapillaryCapillaryCapillaryCapillary
Active phase HP-5 MSDB-5RTX-5 MSDB-5 MSHP-5
Column length (m) 30.60.30.30.50.
Carrier gas HeliumHeliumHeliumHeliumHelium
Substrate
Column diameter (mm) 0.250.250.250.250.32
Phase thickness (μm) 0.251.000.250.251.05
Program not specified40 0C 4 0C/min -> 230 0C 100 0C/min -> 260 0C (11.7 min)not specifiednot specified40 0C (10 min) 5 0C/min -> 200 0C 15 0C/min -> 250 0C (10 min)
I 514.529.515.526.534.
ReferenceKotowska, Zalikowski, et al., 2012Miyazaki, Plotto, et al., 2011Mebazaa, Mahmoudi, et al., 2009Su, Wang, et al., 2009Ventanas, Estevez, et al., 2008
Comment MSDC-RI MSDC-RI MSDC-RI MSDC-RI MSDC-RI
Column type CapillaryCapillaryCapillaryCapillaryCapillary
Active phase DB-5 MSMethyl SiliconeBPX-5HP-5DB-5
Column length (m) 30.60.60.50.50.
Carrier gas HeliumHeliumHe
Substrate
Column diameter (mm) 0.250.320.250.320.32
Phase thickness (μm) 0.251.00.251.051.05
Program 45 0C (0.75 min) 10 0C/min -> 200 0C 30 0C/min -> 245 0C (1.25 min)-50 0C (2 min) 8 0C/min -> 200 0C (7.75 min) 25 0C -> 225 0C (8 min)40C(5min) => 5C/min => 100C => 20C/min => 280C (5min)40C(10min) => 5C/min => 200C => 20C/min => 250C(5min)40C(10min) => 5C/min => 200C => 20C/min => 250C (5min)
I 565.507.521.517.517.
ReferenceCajka, Hajslova, et al., 2007Blunden, Aneja, et al., 2005Duflos, Moine, et al., 2005Garcia-Estaban, Ansorena, et al., 2004Garcia-Estaban, Ansorena, et al., 2004, 2
Comment MSDC-RI MSDC-RI MSDC-RI MSDC-RI MSDC-RI
Column type CapillaryCapillaryCapillaryCapillaryCapillary
Active phase PONADB-5 MSBPX-5Polydimethyl siloxaneRTX-5
Column length (m) 50.30.60.
Carrier gas  HeliumHe
Substrate
Column diameter (mm) 0.200.250.32
Phase thickness (μm) 0.501.01.
Program not specifiednot specified-30C(1min) => 100C/min => 40C(4min) => 2C/min => 90C => 4C/min => 130C => 8C/min => 250Cnot specifiednot specified
I 523.550.543.528.521.
ReferenceYang, Wang, et al., 2003Luo and Agnew, 2001van Ruth, Grossmann, et al., 2001Spanier, Shahidi, et al., 2001Masanetz, Guth, et al., 1998
Comment MSDC-RI MSDC-RI MSDC-RI MSDC-RI MSDC-RI
Column type CapillaryCapillaryCapillaryCapillaryCapillary
Active phase RTX-5Polydimethyl siloxanesSPB-1Polydimethyl siloxanesSPB-1
Column length (m)   60. 30.
Carrier gas   He H2
Substrate
Column diameter (mm)   0.53 0.32
Phase thickness (μm)   5. 4.
Program not specifiednot specified40C(6min) => 5C/min => 80C => 10C/min => 200Cnot specified35(1)-10 -> 55-25 ->250
I 521.503.508.503.506.
ReferenceMasanetz, Guth, et al., 1998Zenkevich, 1998Flanagan, Streete, et al., 1997Zenkevich and Chupalov, 1996Nedjma and Maujean, 1995
Comment MSDC-RI MSDC-RI MSDC-RI MSDC-RI MSDC-RI
Column type CapillaryCapillaryCapillaryCapillaryCapillary
Active phase DB-1SPB-1SE-52SF96+IgepalSE-30
Column length (m) 30.60.100.152.50.
Carrier gas HeHelium  He
Substrate
Column diameter (mm) 0.250.530.500.760.5
Phase thickness (μm) 1.5.0
Program 40C (4min) => 10C/min => 200C => 50C/min => 250C40 0C (6 min) 5 0C/min -> 80 0C 10 0C/min -> 200 0Cnot specified25C(1min) => 5C/min => 50C (4min) => 1.25C/min => 180C-10C (8min) => 12C/min => 26C => 3C/min => 170C (30min)
I 506.508.527.512.493.
ReferenceSchuberth, 1994Strete, Ruprah, et al., 1992van Langenhove and Schamp, 1986Flath, Altieri, et al., 1984Heydanek and McGorrin, 1981
Comment MSDC-RI MSDC-RI MSDC-RI MSDC-RI MSDC-RI

Kovats' RI, non-polar column, isothermal

Data compiled by: NIST Mass Spectrometry Data Center, William E. Wallace, director

Column type CapillaryCapillaryCapillaryCapillaryCapillary
Active phase DB-5DB-5DB-5DB-5OV-3
Column length (m) 30.30.30.30.150.
Carrier gas
Substrate
Column diameter (mm) 0.250.250.250.250.64
Phase thickness (μm) 0.10.10.10.1
Temperature (C) 100.120.60.80.170.
I 533.7543.6532.0530.2528.
ReferenceMiller and Bruno, 2003Miller and Bruno, 2003Miller and Bruno, 2003Miller and Bruno, 2003Buttery, Ling, et al., 1983
Comment MSDC-RI MSDC-RI MSDC-RI MSDC-RI MSDC-RI
Column type PackedPackedPackedCapillaryCapillary
Active phase SE-30Apiezon MApiezon MApiezon LSqualane
Column length (m) 2.2.12.1
Carrier gas  N2N2
Substrate Chromosorb W AW (80-100 mesh)Chromosorb WChromosorb W
Column diameter (mm)
Phase thickness (μm)
Temperature (C) 110.130.130.120.120.
I 508.523.522.520.500.
ReferenceMöckel and Zolg, 1977Golovnya, Garbuzov, et al., 1976Golovnya and Garbuzov, 1974Agr, Tesaric, et al., 1973Agr, Tesaric, et al., 1973
Comment MSDC-RI MSDC-RI MSDC-RI MSDC-RI MSDC-RI
Column type CapillaryCapillaryCapillaryCapillaryCapillary
Active phase SqualaneSqualaneSqualaneApiezon LE-301
Column length (m)  50.50.100.
Carrier gas  N2N2N2
Substrate  Celite 545Celite 545
Column diameter (mm)  0.30.30.3
Phase thickness (μm)
Temperature (C) 86.120.86.120.60.
I 497.500.497.520.532.
ReferenceAgr, Tesaric, et al., 1973Agrawal, Tesarík, et al., 1972Agrawal, Tesarík, et al., 1972Agrawal, Tesarík, et al., 1972Kudryavtseva, Fatalieva, et al., 1972
Comment MSDC-RI MSDC-RI MSDC-RI MSDC-RI MSDC-RI
Column type PackedPackedPackedPackedPacked
Active phase DC-200SE-30Apiezon LApiezon LApiezon L
Column length (m) 1.51.5
Carrier gas
Substrate
Column diameter (mm)
Phase thickness (μm)
Temperature (C) 60.60.110.130.150.
I 516.515.516.523.528.
ReferenceGolovnya and Arsen'ev, 1970Golovnya and Arsen'ev, 1970Martinu and Janák, 1970Martinu and Janák, 1970Martinu and Janák, 1970
Comment MSDC-RI MSDC-RI MSDC-RI MSDC-RI MSDC-RI
Column type Packed
Active phase DC-200
Column length (m) 4.
Carrier gas
Substrate Celite
Column diameter (mm)
Phase thickness (μm)
Temperature (C) 120.
I 550.
ReferenceReymond, Mueggler-Chavan, et al., 1966
Comment MSDC-RI

Van Den Dool and Kratz RI, non-polar column, custom temperature program

Data compiled by: NIST Mass Spectrometry Data Center, William E. Wallace, director

Column type CapillaryCapillaryCapillaryCapillaryCapillary
Active phase SPB-5HP-5MSDB-5DB-5DB-5
Column length (m) 30.30.30.60.30.
Carrier gas  HeHeHeHe
Substrate
Column diameter (mm) 0.530.250.320.320.25
Phase thickness (μm) 1.50.251.1.0.25
Program 40C(1min) => 6C/min => 180C => 20C/min => 280C5C(8min) => 3C/min => 20C => 10C/min => 150C(10min)40C (2min) => 5C/min => 100C => 4C/min => 230C (10min)40C(4min) => 2C/min => 90C => 4C/min => 130C 8C/min => 250C40C(2min) => 5C/min => 100C => 4C/min => 230C(10min)
I 513.515.517.526.516.
ReferenceMajcher and Jelen, 2007Bonaiti, Irlinger, et al., 2005Klesk, Qian, et al., 2004Boscaini, van Ruth, et al., 2003Klesk and Qian, 2003
Comment MSDC-RI MSDC-RI MSDC-RI MSDC-RI MSDC-RI
Column type CapillaryCapillary
Active phase HP-5SE-54
Column length (m) 30.25.
Carrier gas HeHe
Substrate
Column diameter (mm) 0.250.32
Phase thickness (μm) 0.250.5
Program 5C(5min) => 3C/min => 20C => 5C/min => 100C 15C/min => 150C (5min)35C (2min) => 4C/min => 150C => 10C/min => 240C
I 515.500.
ReferenceEngel, Baty, et al., 2002Fickert and Schieberle, 1998
Comment MSDC-RI MSDC-RI

References

Voronkov, Klyuchnikov, et al., 1989
Voronkov, M.G.; Klyuchnikov, V.A.; Kolabin, S.N.; Shvets, G.N.; Varusin, P.I.; Deryagina, E.N.; Korchevin, N.A.; Tsvetnitskaya, S.I.,
Thermochemical properties of diorganyl chalcogenides and dichalcogenides RMnR(M = S, Se, Te; n = 1, 2).,
Dokl. Phys. Chem. (Engl. Transl.), 1989, 307, 650-653, In original 1139. [all data]
McCullough, Hubbard, et al., 1957
McCullough, J.P.; Hubbard, W.N.; Frow, F.R.; Hossenlopp, I.A.; Waddington, G.,
Ethanethiol and 2-thiapropane: Heats of formation and isomerization; the chemical thermodynamic properties from 0 to 1000°K,
J. Am. Chem. Soc., 1957, 79, 561-566. [all data]
Douglas, 1946
Douglas, T.B.,
Heats of formation of liquid methyl sulfoxide and crystalline methyl sulfone at 18°,
J. Am. Chem. Soc., 1946, 68, 1072-1076. [all data]
Cox and Pilcher, 1970
Cox, J.D.; Pilcher, G.,
Thermochemistry of Organic and Organometallic Compounds, Academic Press, New York, 1970, 1-636. [all data]
Haines, Helm, et al., 1956
Haines, W.E.; Helm, R.V.; Cook, G.L.; Ball, J.S.,
Purification and Properties of Organic Sulfur Compounds,
J. Phys. Chem., 1956, 60, 549-55. [all data]
Mcallan, Cullum, et al., 1951
Mcallan, D.T.; Cullum, T.V.; Dean, R.A.; Fidler, F.A.,
The Preparation and Properties of Sulfur Compounds Related to Petroleum I. The Dialkyl Sulfides and Disulfides,
J. Am. Chem. Soc., 1951, 73, 3627-32. [all data]
Osborne, Doescher, et al., 1942
Osborne, D.W.; Doescher, R.N.; Yost, D.M.,
The heat capacity, heats of fusion and vaporization, vapor pressure and entropy of dimethyl sulfide.,
J. Am. Chem. Soc., 1942, 64, 169-72. [all data]
Majer and Svoboda, 1985
Majer, V.; Svoboda, V.,
Enthalpies of Vaporization of Organic Compounds: A Critical Review and Data Compilation, Blackwell Scientific Publications, Oxford, 1985, 300. [all data]
Berthoud and Brum, 1924
Berthoud, A.; Brum, R.,
Physical Properties of Some Organic Compounds.,
J. Chim. Phys. Phys.-Chim. Biol., 1924, 21, 143-60. [all data]
Herz and Neukirch, 1923
Herz, W.; Neukirch, E.,
On Knowldge of the Critical State,
Z. Phys. Chem., Stoechiom. Verwandtschaftsl., 1923, 104, 433-50. [all data]
Stephenson and Malanowski, 1987
Stephenson, Richard M.; Malanowski, Stanislaw,
Handbook of the Thermodynamics of Organic Compounds, 1987, https://doi.org/10.1007/978-94-009-3173-2
. [all data]
White, Barnard--Smith, et al., 1952
White, P.T.; Barnard--Smith, D.G.; Fidler, F.A.,
Vapor Pressure--Temperature Relationships of Sulfur Compounds Related to Petroleum,
Ind. Eng. Chem., 1952, 44, 6, 1430-1438, https://doi.org/10.1021/ie50510a064
. [all data]
Osborne, Doescher, et al., 1942, 2
Osborne, D.W.; Doescher, R.N.; Yost, D.M.,
The heat capacity, heats of fusion and vaporization, vapor pressure and entropy of dimethyl sulfide,
J. Am. Chem. Soc., 1942, 64, 169-172. [all data]
Thompson and Linnett, 1935
Thompson, H.W.; Linnett, J.W.,
The vapour pressures of some alkyl sulphides,
Trans. Faraday Soc., 1935, 31, 1743, https://doi.org/10.1039/tf9353101743
. [all data]
Domalski and Hearing, 1996
Domalski, Eugene S.; Hearing, Elizabeth D.,
Heat Capacities and Entropies of Organic Compounds in the Condensed Phase. Volume III,
J. Phys. Chem. Ref. Data, 1996, 25, 1, 1, https://doi.org/10.1063/1.555985
. [all data]
Moran and Ellison, 1988
Moran, S.; Ellison, G.B.,
Photoelectron Spectroscopy of Sulfur Ions,
J. Phys. Chem., 1988, 92, 7, 1794, https://doi.org/10.1021/j100318a021
. [all data]
Ingemann and Nibbering, 1985
Ingemann, S.; Nibbering, N.M.M.,
Gas phase chemistry of alpha-thio carbanions,
Can. J. Chem., 1985, 62, 2273. [all data]
Meot-Ner (Mautner) and Sieck, 1985
Meot-Ner (Mautner), M.; Sieck, L.W.,
The Ionic Hydrogen Bond and Ion Solvation. 4. SH+ O and NH+ S Bonds. Correlations with Proton Affinity. Mutual Effects of Weak and Strong Ligands in Mixed Clusters,
J. Phys. Chem., 1985, 89, 24, 5222, https://doi.org/10.1021/j100270a021
. [all data]
Deng, Illies, et al., 1995
Deng, Y.; Illies, A.J.; James, M.A.; McKee, M.L.; Peschke, M.,
A Definitive Investigation of the Gas-Phase Two-Center Three-electron Bond in [H2S:SH2+], [Me2S:SMe2]+, and [Et2S:SEt2]+: Therory and Experiment,
J. Am. Chem. Soc., 1995, 117, 1, 420, https://doi.org/10.1021/ja00106a048
. [all data]
Meot-Ner (Mautner) and Sieck, 1991
Meot-Ner (Mautner), M.; Sieck, L.W.,
Proton affinity ladders from variable-temperature equilibrium measurements. 1. A reevaluation of the upper proton affinity range,
J. Am. Chem. Soc., 1991, 113, 12, 4448, https://doi.org/10.1021/ja00012a012
. [all data]
Staley and Beauchamp, 1975
Staley, R.H.; Beauchamp, J.L.,
Intrinsic Acid - Base Properties of Molecules. Binding Energies of Li+ to pi - and n - Donor Bases,
J. Am. Chem. Soc., 1975, 97, 20, 5920, https://doi.org/10.1021/ja00853a050
. [all data]
Dzidic and Kebarle, 1970
Dzidic, I.; Kebarle, P.,
Hydration of the Alkali Ions in the Gas Phase. Enthalpies and Entropies of Reactions M+(H2O)n-1 + H2O = M+(H2O)n,
J. Phys. Chem., 1970, 74, 7, 1466, https://doi.org/10.1021/j100702a013
. [all data]
McMahon and Ohanessian, 2000
McMahon, T.B.; Ohanessian, G.,
An Experimental and Ab Initio Study of the Nature of the Binding in Gas-Phase Complexes of Sodium Ions,
Chem. Eur. J., 2000, 6, 16, 2931, https://doi.org/10.1002/1521-3765(20000818)6:16<2931::AID-CHEM2931>3.0.CO;2-7
. [all data]
Shum and Benson, 1985
Shum, L.G.S.; Benson, S.W.,
Iodine catalyzed pyrolysis of dimethyl sulfide. Heats of formaton of CH3SCH2I, the CH3SCH2 radical, and the pibond energy in CH2S,
Int. J. Chem. Kinet., 1985, 17, 277-292. [all data]