N-isopropyl-tert-butylamine
- Formula: C7H17N
- Molecular weight: 115.2166
- IUPAC Standard InChIKey: ZWXQPERWRDHCMZ-UHFFFAOYSA-N
- CAS Registry Number: 7515-80-2
- Chemical structure:
View 3d structure (requires JavaScript / HTML 5) - Species with the same structure:
- Other names: tert-butylisopropylamine

Phase change data

Data compiled by: William E. Acree, Jr., James S. Chickos
Enthalpy of vaporization
ΔvapH (kJ/mol) | Temperature (K) | Reference | Comment |
---|---|---|---|
35.7 ± 1.0 | 287. | Verevkin, 1997 | Based on data from 275. to 299. K. |

References

Verevkin, 1997
Verevkin, Sergey P.,
Thermochemistry of amines: experimental standard molar enthalpies of formation of some aliphatic and aromatic amines,
The Journal of Chemical Thermodynamics, 1997, 29, 8, 891-899, https://doi.org/10.1006/jcht.1997.0212
. [all data]