Triacontanoic acid, ethyl ester
- Formula: C32H64O2
- Molecular weight: 480.8494
- IUPAC Standard InChIKey: IPUBNDNLVZUJAA-UHFFFAOYSA-N
- CAS Registry Number: 7505-12-6
- Chemical structure:
View 3d structure (requires JavaScript / HTML 5) - Other names: Ethyl triacontanate

Phase change data

Data compiled as indicated in comments:
AC - William E. Acree, Jr., James S. Chickos
DH - Eugene S. Domalski and Elizabeth D. Hearing
Enthalpy of fusion
ΔfusH (kJ/mol) | Temperature (K) | Reference | Comment |
---|---|---|---|
36.07 | 341.5 | Domalski and Hearing, 1996 | AC |
Enthalpy of phase transition
ΔHtrs (kJ/mol) | Temperature (K) | Initial Phase | Final Phase | Reference | Comment |
---|---|---|---|---|---|
16.196 | 334.65 | crystaline, II, á | crystaline, I, à transition | King and Garner, 1934 | DH |
36.073 | 341.45 | crystaline, I, à | liquid, liq transition | King and Garner, 1934 | DH |

Normal alkane RI, non-polar column, temperature ramp

Column type | Active phase | I | Reference | Comment |
---|---|---|---|---|
Capillary | DB-1MS | 3381.5 | Stransky, Zarevucka, et al., 2006 | 30. m/0.252 mm/0.25 μm, H2, 1. K/min; Tstart: 240. C; Tend: 340. C |

References

Domalski and Hearing, 1996
Domalski, Eugene S.; Hearing, Elizabeth D.,
Heat Capacities and Entropies of Organic Compounds in the Condensed Phase. Volume III,
J. Phys. Chem. Ref. Data, 1996, 25, 1, 1, https://doi.org/10.1063/1.555985
. [all data]
King and Garner, 1934
King, A.M.; Garner, W.E.,
The heats of crystallisation of the ethyl esters of the monobasic aliphatic acids, 1934, J. [all data]