Lead borate

Condensed phase thermochemistry data

Quantity Value Units Method Reference Comment
Δfsolid-7087.70kJ/molReviewChase, 1998Data last reviewed in March, 1965
Quantity Value Units Method Reference Comment
solid353.03J/mol*KReviewChase, 1998Data last reviewed in March, 1965

Solid Phase Heat Capacity (Shomate Equation)

Cp° = A + B*t + C*t2 + D*t3 + E/t2
H° − H°298.15= A*t + B*t2/2 + C*t3/3 + D*t4/4 − E/t + F − H
S° = A*ln(t) + B*t + C*t2/2 + D*t3/3 − E/(2*t2) + G
    Cp = heat capacity (J/mol*K)
    H° = standard enthalpy (kJ/mol)
    S° = standard entropy (J/mol*K)
    t = temperature (K) / 1000.

View plot Requires a JavaScript / HTML 5 canvas capable browser.

View table.

Temperature (K) 298. - 2000.
A 68.83810
B 1378.406
C -792.1735
D 153.8829
E -0.558464
F -7164.598
G 56.07480
H -7087.696
ReferenceChase, 1998
Comment Data last reviewed in March, 1965

References

Chase, 1998
Chase, M.W., Jr., NIST-JANAF Themochemical Tables, Fourth Edition, J. Phys. Chem. Ref. Data, Monograph 9, 1998, 1-1951. [all data]