Ethene, chloro-
- Formula: C2H3Cl
- Molecular weight: 62.498
- IUPAC Standard InChIKey: BZHJMEDXRYGGRV-UHFFFAOYSA-N
- CAS Registry Number: 75-01-4
- Chemical structure:
View 3d structure (requires JavaScript / HTML 5) - Other names: Ethylene, chloro-; Chloroethene; Chloroethylene; Monochloroethylene; Vinyl chloride; Vinyl chloride monomer; Vinyl C monomer; C2H3Cl; Ethylene monochloride; Monochloroethene; Chlorethene; Chlorethylene; Chlorure de vinyle; Cloruro di vinile; Rcra waste number U043; Trovidur; UN 1086; VC; VCM; Vinylchlorid; Vinyle(chlorure de); Winylu chlorek

Gas phase thermochemistry data

Data compiled as indicated in comments:
DRB - Donald R. Burgess, Jr.
ALS - Hussein Y. Afeefy, Joel F. Liebman, and Stephen E. Stein
Quantity | Value | Units | Method | Reference | Comment |
---|---|---|---|---|---|
ΔfH°gas | 22. ± 3. | kJ/mol | Review | Manion, 2002 | weighted average of several measurements; DRB |
ΔfH°gas | 29. | kJ/mol | Eqk | Levanova, Treger, et al., 1976 | ALS |
ΔfH°gas | 21. | kJ/mol | Eqk | Alfassi, Golden, et al., 1973 | Heat of reaction not reported; ALS |
ΔfH°gas | 35.3 ± 1.4 | kJ/mol | Cm | Lacher, Gottlieb, et al., 1962 | Reanalyzed by Cox and Pilcher, 1970, Original value = 33.8 ± 1.2 kJ/mol; ALS |
ΔfH°gas | 38.1 ± 0.84 | kJ/mol | Chyd | Lacher, Emery, et al., 1956 | Reanalyzed by Cox and Pilcher, 1970, Original value = 37.2 ± 0.8 kJ/mol; At 298 K, see Lacher, Kianpour, et al., 1956; ALS |

Condensed phase thermochemistry data

Data compiled as indicated in comments:
DRB - Donald R. Burgess, Jr.
DH - Eugene S. Domalski and Elizabeth D. Hearing
Quantity | Value | Units | Method | Reference | Comment |
---|---|---|---|---|---|
ΔfH°liquid | 0.9 ± 3.2 | kJ/mol | Review | Manion, 2002 | derived from recommended ΔfHgas° and ΔvapH°; DRB |
Quantity | Value | Units | Method | Reference | Comment |
S°liquid | 118.0 | J/mol*K | N/A | Lebedev, Rabinovich, et al., 1967 | DH |
Constant pressure heat capacity of liquid
Cp,liquid (J/mol*K) | Temperature (K) | Reference | Comment |
---|---|---|---|
89.45 | 298.15 | Lebedev, Rabinovich, et al., 1967 | T = 58 to 300 K.; DH |

Phase change data

Data compiled as indicated in comments:
TRC - Thermodynamics Research Center, NIST Boulder Laboratories, Chris Muzny director
DRB - Donald R. Burgess, Jr.
AC - William E. Acree, Jr., James S. Chickos
DH - Eugene S. Domalski and Elizabeth D. Hearing
Quantity | Value | Units | Method | Reference | Comment |
---|---|---|---|---|---|
Tboil | 259.45 | K | N/A | Dreisbach and Martin, 1949 | Uncertainty assigned by TRC = 0.2 K; TRC |
Tboil | 259.05 | K | N/A | Stull, 1946 | Uncertainty assigned by TRC = 0.4 K; TRC |
Tboil | 259.3 | K | N/A | Dana, Burdick, et al., 1927 | Uncertainty assigned by TRC = 0.2 K; TRC |
Quantity | Value | Units | Method | Reference | Comment |
Tfus | 94.43 | K | N/A | McDonald, Shrader, et al., 1959 | Uncertainty assigned by TRC = 0.1 K; TRC |
Tfus | 119.36 | K | N/A | Dreisbach, 1955 | Uncertainty assigned by TRC = 0.02 K; TRC |
Tfus | 113.5 | K | N/A | Dana, Burdick, et al., 1927 | Uncertainty assigned by TRC = 0.2 K; TRC |
Quantity | Value | Units | Method | Reference | Comment |
Ttriple | 119.31 | K | N/A | Lebedev, Rabinovich, et al., 1967, 2 | Uncertainty assigned by TRC = 0.02 K; TRC |
Quantity | Value | Units | Method | Reference | Comment |
ΔvapH° | 21. ± 1. | kJ/mol | Review | Manion, 2002 | derived from vapor pressure data of Dana, Burdick, et al., 1927 plus a correction for non-ideality; DRB |
Enthalpy of vaporization
ΔvapH (kJ/mol) | Temperature (K) | Method | Reference | Comment |
---|---|---|---|---|
23.3 | 245. | A | Stephenson and Malanowski, 1987 | Based on data from 209. to 260. K. See also McDonald, Shrader, et al., 1959, 2 and Dykyj, 1970.; AC |
22.7 | 265. | N/A | Danov and Golubev, 1967 | Based on data from 243. to 288. K.; AC |
22.9 | 258. | N/A | Haccuria and Mathieu, 1967 | Based on data from 213. to 273. K.; AC |
Antoine Equation Parameters
log10(P) = A − (B / (T + C))
P = vapor pressure (bar)
T = temperature (K)
View plot Requires a JavaScript / HTML 5 canvas capable browser.
Temperature (K) | A | B | C | Reference |
---|---|---|---|---|
165.3 to 259.4 | 3.98598 | 892.757 | -35.051 | McDonald, Shrader, et al., 1959, 2 |
Enthalpy of fusion
ΔfusH (kJ/mol) | Temperature (K) | Reference | Comment |
---|---|---|---|
4.916 | 119.31 | Lebedev, Rabinovich, et al., 1967 | DH |
4.92 | 119.3 | Domalski and Hearing, 1996 | AC |
Entropy of fusion
ΔfusS (J/mol*K) | Temperature (K) | Reference | Comment |
---|---|---|---|
41.2 | 119.31 | Lebedev, Rabinovich, et al., 1967 | DH |

Reaction thermochemistry data

Data compiled by: Hussein Y. Afeefy, Joel F. Liebman, and Stephen E. Stein
Individual Reactions
By formula: C2H4Cl2 = C2H3Cl + HCl
Quantity | Value | Units | Method | Reference | Comment |
---|---|---|---|---|---|
ΔrH° | 50.6 ± 4.2 | kJ/mol | Cm | Buravtsev, Grigor'ev, et al., 1992 | gas phase |
ΔrH° | 82.0 | kJ/mol | Eqk | Levanova, Bushneva, et al., 1979 | liquid phase |
ΔrH° | 68.2 | kJ/mol | Eqk | Levanova, Bushneva, et al., 1979 | gas phase |
ΔrH° | 67.95 | kJ/mol | Eqk | Ghosh and Guha, 1951 | liquid phase |
By formula: C2H4Cl2 = C2H3Cl + HCl
Quantity | Value | Units | Method | Reference | Comment |
---|---|---|---|---|---|
ΔrH° | 74.5 | kJ/mol | Eqk | Levanova, Bushneva, et al., 1979 | liquid phase |
ΔrH° | 61.9 | kJ/mol | Eqk | Levanova, Bushneva, et al., 1979 | gas phase |
By formula: 2H2 + C2H3Cl = C2H6 + HCl
Quantity | Value | Units | Method | Reference | Comment |
---|---|---|---|---|---|
ΔrH° | -214.2 ± 0.8 | kJ/mol | Chyd | Lacher, Emery, et al., 1956 | gas phase; At 298 K, see Lacher, Kianpour, et al., 1956 |
By formula: C2H4BrCl = HBr + C2H3Cl
Quantity | Value | Units | Method | Reference | Comment |
---|---|---|---|---|---|
ΔrH° | 83.3 ± 0.8 | kJ/mol | Eqk | Busheva, Levanova, et al., 1980 | gas phase; Dehydrohalogenation |
By formula: H2 + C2H3Cl = C2H4 + HCl
Quantity | Value | Units | Method | Reference | Comment |
---|---|---|---|---|---|
ΔrH° | -76.94 | kJ/mol | Chyd | Lacher, Kianpour, et al., 1956 | gas phase; At 298 K |
By formula: C2H3Cl = C2H3Cl
Quantity | Value | Units | Method | Reference | Comment |
---|---|---|---|---|---|
ΔrH° | -176. ± 15. | kJ/mol | Cm | LaVilla and Goodman, 1989 | gas phase; solvent: Heptane |
By formula: C2H3Cl = C2H2 + HCl
Quantity | Value | Units | Method | Reference | Comment |
---|---|---|---|---|---|
ΔrH° | 100.7 ± 1.2 | kJ/mol | Cm | Lacher, Gottlieb, et al., 1962 | gas phase |
By formula: C2H3ClN2 = C2H3Cl + N2
Quantity | Value | Units | Method | Reference | Comment |
---|---|---|---|---|---|
ΔrH° | -196. ± 14. | kJ/mol | Cm | Archer and Tyler, 1976 | gas phase |
By formula: C2H3Cl + HCl = C2H4Cl2
Quantity | Value | Units | Method | Reference | Comment |
---|---|---|---|---|---|
ΔrH° | -92.68 | kJ/mol | Eqk | Levanova, Treger, et al., 1976 | gas phase |

Henry's Law data

Data compiled by: Rolf Sander
Henry's Law constant (water solution)
kH(T) = k°H exp(d(ln(kH))/d(1/T) ((1/T) - 1/(298.15 K)))
k°H = Henry's law constant for solubility in water at 298.15 K (mol/(kg*bar))
d(ln(kH))/d(1/T) = Temperature dependence constant (K)
k°H (mol/(kg*bar)) | d(ln(kH))/d(1/T) (K) | Method | Reference | Comment |
---|---|---|---|---|
0.039 | 3100. | L | N/A | |
0.044 | Q | N/A | missing citation give several references for the Henry's law constants but don't assign them to specific species. | |
0.040 | 2900. | X | N/A | |
0.038 | 3300. | M | Gossett, 1987 | |
0.00094 | V | N/A | ||
0.043 | V | N/A | ||
0.046 | 3000. | L | N/A | |
0.018 | V | N/A | ||
0.00082 | M | Pearson and McConnell, 1975 | The same data was also published in missing citation. Value at T = 283. K. |

Gas phase ion energetics data

Data evaluated as indicated in comments:
L - Sharon G. Lias
Data compiled as indicated in comments:
LL - Sharon G. Lias and Joel F. Liebman
LBLHLM - Sharon G. Lias, John E. Bartmess, Joel F. Liebman, John L. Holmes, Rhoda D. Levin, and W. Gary Mallard
LLK - Sharon G. Lias, Rhoda D. Levin, and Sherif A. Kafafi
RDSH - Henry M. Rosenstock, Keith Draxl, Bruce W. Steiner, and John T. Herron
Quantity | Value | Units | Method | Reference | Comment |
---|---|---|---|---|---|
IE (evaluated) | 9.99 ± 0.02 | eV | N/A | N/A | L |
Ionization energy determinations
IE (eV) | Method | Reference | Comment |
---|---|---|---|
9.98 ± 0.02 | PI | Sheng, Qi, et al., 1995 | LL |
9.99 ± 0.02 | PI | Reinke, Kraessig, et al., 1973 | LLK |
10.01 | PE | Mines and Thompson, 1973 | LLK |
10.00 | PE | Lake and Thompson, 1970 | RDSH |
10.00 ± 0.01 | PI | Sood and Watanabe, 1966 | RDSH |
10.00 ± 0.01 | S | Sood and Watanabe, 1966 | RDSH |
10.00 ± 0.02 | PI | Momigny, 1963 | RDSH |
10.0 ± 0.01 | PI | Watanabe, Nakayama, et al., 1962 | RDSH |
9.995 | PI | Bralsford, Harris, et al., 1960 | RDSH |
10.00 ± 0.01 | S | Walsh, 1945 | RDSH |
10.2 | PE | Cambi, Ciullo, et al., 1983 | Vertical value; LBLHLM |
10.2 | PE | Von Niessen, Asbrink, et al., 1982 | Vertical value; LBLHLM |
10.15 | PE | Wittel and Bock, 1974 | Vertical value; LLK |
Appearance energy determinations
Ion | AE (eV) | Other Products | Method | Reference | Comment |
---|---|---|---|---|---|
C2H2+ | 12.5 ± 0.1 | HCl | PI | Reinke, Kraessig, et al., 1973 | LLK |
C2H2+ | 13.8 ± 0.3 | HCl | EI | Hughes, Tiernan, et al., 1969 | RDSH |
C2H2Cl+ | 14.90 ± 0.05 | H | PI | Sheng, Qi, et al., 1995 | LL |
C2H3+ | 12.54 ± 0.02 | Cl | PI | Sheng, Qi, et al., 1995 | LL |
C2H3+ | 12.48 ± 0.04 | Cl | PI | Reinke, Kraessig, et al., 1973 | LLK |
C2H3+ | 12.56 ± 0.09 | Cl | EI | Finney and Harrison, 1972 | LLK |
C2H3+ | 12.5 | Cl | EI | Lossing, 1971 | LLK |
H+ | 18.63 ± 0.05 | C2H2Cl | PI | Sheng, Qi, et al., 1995 | LL |

Normal alkane RI, polar column, custom temperature program

Data compiled by: NIST Mass Spectrometry Data Center, William E. Wallace, director

Column type Capillary
Active phase Carbowax 20M
Column length (m)
Carrier gas
Substrate
Column diameter (mm)
Phase thickness (μm)
Program not specified
I 505.
ReferenceRamsey and Flanagan, 1982
Comment MSDC-RI

References

Manion, 2002
Manion, J.A.,
Evaluated Enthalpies of Formation of the Stable Closed Shell C1 and C2 Chlorinated Hydrocarbons,
J. Phys. Chem. Ref. Data, 2002, 31, 1, 123-172, https://doi.org/10.1063/1.1420703
. [all data]
Levanova, Treger, et al., 1976
Levanova, S.V.; Treger, Yu.A.; Velichko, S.M.; Rozhnov, A.M.,
Equilibria in the reactions of vinyl chloride,
Russ. J. Phys. Chem. (Engl. Transl.), 1976, 50, 1148. [all data]
Alfassi, Golden, et al., 1973
Alfassi, Z.B.; Golden, D.M.; Benson, S.W.,
The thermochemistry of the isomerization of 3-halopropenes (allyl halides) to 1-halopropenes; entropy and enthalpy of formation contribution of the Cd-(H)(X) group,
J. Chem. Thermodyn., 1973, 5, 411-420. [all data]
Lacher, Gottlieb, et al., 1962
Lacher, J.R.; Gottlieb, H.B.; Park, J.D.,
Reaction heats of organic compounds. Part 2.-Heat of addition of hydrogen chloride to acetylene,
Trans. Faraday Soc., 1962, 58, 2348-2351. [all data]
Cox and Pilcher, 1970
Cox, J.D.; Pilcher, G.,
Thermochemistry of Organic and Organometallic Compounds, Academic Press, New York, 1970, 1-636. [all data]
Lacher, Emery, et al., 1956
Lacher, J.R.; Emery, E.; Bohmfalk, E.; Park, J.D.,
Reaction heats of organic compounds. IV. A high temperature calorimeter and the hydrogenation of methyl ethyl and vinyl chlorides,
J. Phys. Chem., 1956, 60, 492-495. [all data]
Lacher, Kianpour, et al., 1956
Lacher, J.R.; Kianpour, A.; Oetting, F.; Park, J.D.,
Reaction calorimetry. The hydrogenation of organic fluorides and chlorides,
Trans. Faraday Soc., 1956, 52, 1500-1508. [all data]
Lebedev, Rabinovich, et al., 1967
Lebedev, B.V.; Rabinovich, I.B.; Budarina, V.A.,
Heat capacity of vinyl chloride, polyvinylchloride and polyvinylidene chloride in the region of 60-300°K,
Polymer Sci., 1967, USSR 9A, 545-552. [all data]
Dreisbach and Martin, 1949
Dreisbach, R.R.; Martin, R.A.,
Physical Data on Some Organic Compounds,
Ind. Eng. Chem., 1949, 41, 2875-8. [all data]
Stull, 1946
Stull, D.R.,
Anal. Chem., 1946, 18, 234. [all data]
Dana, Burdick, et al., 1927
Dana, L.I.; Burdick, J.N.; Jenkins, A.C.,
SOME PHYSICAL PROPERTIES OF VINYL CHLORIDE,
J. Am. Chem. Soc., 1927, 49, 11, 2801, https://doi.org/10.1021/ja01410a021
. [all data]
McDonald, Shrader, et al., 1959
McDonald, R.A.; Shrader, S.A.; Stull, D.R.,
Vapor Pressures and Freezing Points of 30 Organics,
J. Chem. Eng. Data, 1959, 4, 311. [all data]
Dreisbach, 1955
Dreisbach, R.R.,
Physical Properties of Chemical Compounds, Advances in Chemistry Series No. 15, Am. Chem. Soc.: Washington, D. C., 1955. [all data]
Lebedev, Rabinovich, et al., 1967, 2
Lebedev, B.V.; Rabinovich, I.B.; Budarina, V.A.,
Heat Capacity of vinyl chloride, polyvinylchloride and polyvinylidene chloride in the region of 60-300 K,
Polym. Sci. USSR (Engl. Transl.), 1967, 9, 545. [all data]
Stephenson and Malanowski, 1987
Stephenson, Richard M.; Malanowski, Stanislaw,
Handbook of the Thermodynamics of Organic Compounds, 1987, https://doi.org/10.1007/978-94-009-3173-2
. [all data]
McDonald, Shrader, et al., 1959, 2
McDonald, R.A.; Shrader, S.A.; Stull, D.R.,
Vapor Pressures and Freezing Points of Thirty Pure Organic Compounds.,
J. Chem. Eng. Data, 1959, 4, 4, 311-313, https://doi.org/10.1021/je60004a009
. [all data]
Dykyj, 1970
Dykyj, J.,
Petrochemica, 1970, 10, 2, 51. [all data]
Danov and Golubev, 1967
Danov, S.M.; Golubev, Y.D.,
Tr. Khim. Khim. Tekhnol, 1967, 52. [all data]
Haccuria and Mathieu, 1967
Haccuria, M.; Mathieu, M.P.,
Ind. Chim. Belg., 1967, 32, 165. [all data]
Domalski and Hearing, 1996
Domalski, Eugene S.; Hearing, Elizabeth D.,
Heat Capacities and Entropies of Organic Compounds in the Condensed Phase. Volume III,
J. Phys. Chem. Ref. Data, 1996, 25, 1, 1, https://doi.org/10.1063/1.555985
. [all data]
Buravtsev, Grigor'ev, et al., 1992
Buravtsev, N.N.; Grigor'ev, A.S.; Zaidman, O.A.; Kolbanovskii, Yu.A.; Markelov, M.YU.; Sadogurskii, M.N.; Treger, Yu.A.,
Dehydrochlorination of chloroalkanes under rigid homogeneous conditions. II. Effect of small additions of oxygen to the kinetics of high-temperature decomposition of 1,2-dichloroethane under adiabatic compression,
Khim. Fiz., 1992, 11, 218-226. [all data]
Levanova, Bushneva, et al., 1979
Levanova, s.V.; Bushneva, I.I.; Rodova, R.M.; Rozhnov, A.M.; Treger, Yu.A.; Aprelkin, A.S.,
Thermodynamic stability of chloroethanes in dehydrochlorination reactions,
J. Appl. Chem. USSR, 1979, 52, 1439-1442. [all data]
Ghosh and Guha, 1951
Ghosh, J.C.; Guha, S.R.D.,
Catalytic dehydrochlorination of ethylene dichloride,
Petroleum (London), 1951, 14, 261-264. [all data]
Busheva, Levanova, et al., 1980
Busheva, L.I.; Levanova, S.V.; Rodova, R.M.; Rozhnov, A.M.,
Thermocatalytic reactions of 1,1-bromochloroethane,
Russ. J. Phys. Chem. (Engl. Transl.), 1980, 54, 1403-1404. [all data]
LaVilla and Goodman, 1989
LaVilla, J.A.; Goodman, J.L.,
The 1,2-hydrogen-shift rearrangement in alkylchlorocarbenes,
J. Am. Chem. Soc., 1989, 111, 6877-6878. [all data]
Archer and Tyler, 1976
Archer, W.H.; Tyler, B.J.,
Self-heating in the decomposition of 3-methyl-3-chlorodiazirine: Determination of reaction exothermicity and correction of Arrhenius parameters,
J. Chem. Soc. Faraday Trans. 1, 1976, 72, 1448-1455. [all data]
Gossett, 1987
Gossett, J.M.,
Measurement of Henry's Law Constants for C1 and C2 Chlorinated Hydrocarbons,
Environ. Sci. Technol., 1987, 21, 202-208. [all data]
Pearson and McConnell, 1975
Pearson, C.R.; McConnell, G.,
Chlorinated C1 and C2 Hydrocarbons in the Marine Environment,
Proc. R. Soc. London, B, 1975, 189, 305-332. [all data]