Ethanol, 2-([1,1'-biphenyl]-2-yloxy)-
- Formula: C14H14O2
- Molecular weight: 214.2598
- IUPAC Standard InChIKey: NOZAKUWNUGNDLI-UHFFFAOYSA-N
- CAS Registry Number: 7501-02-2
- Chemical structure:
View 3d structure (requires JavaScript / HTML 5) - Other names: β-Hydroxyethyl ether of o-phenylphenol; Ethanol, 2-(o-biphenylyloxy)-; Ethanol, 2-(2-biphenylyloxy)-; Ethyl alcohol, 2-(o-biphenylyloxy)-; Ethyl alcohol, 2-(o-phenyl)phenoxy-; 2-(2-Biphenyloxy)ethanol

Phase change data

Data compiled as indicated in comments:
TRC - Thermodynamics Research Center, NIST Boulder Laboratories, Chris Muzny director
AC - William E. Acree, Jr., James S. Chickos
Quantity | Value | Units | Method | Reference | Comment |
---|---|---|---|---|---|
Tfus | 346.15 | K | N/A | McDonald, Shrader, et al., 1959 | Uncertainty assigned by TRC = 1. K; TRC |
Enthalpy of vaporization
ΔvapH (kJ/mol) | Temperature (K) | Method | Reference | Comment |
---|---|---|---|---|
71.9 | 425. | A | Stephenson and Malanowski, 1987 | Based on data from 410. to 608. K.; AC |

References

McDonald, Shrader, et al., 1959
McDonald, R.A.; Shrader, S.A.; Stull, D.R.,
Vapor Pressures and Freezing Points of 30 Organics,
J. Chem. Eng. Data, 1959, 4, 311. [all data]
Stephenson and Malanowski, 1987
Stephenson, Richard M.; Malanowski, Stanislaw,
Handbook of the Thermodynamics of Organic Compounds, 1987, https://doi.org/10.1007/978-94-009-3173-2
. [all data]