5,5'-Hydrazotetrazole
- Formula: C2H4N10
- Molecular weight: 168.1202
- IUPAC Standard InChIKey: KOVNXYJOKSNDJA-UHFFFAOYSA-N
- CAS Registry Number: 74999-19-2
- Chemical structure:
View 3d structure (requires JavaScript / HTML 5) - Permanent link for this species. Use this link for bookmarking this species for future reference.

Condensed phase thermochemistry data

Data compiled by: Hussein Y. Afeefy, Joel F. Liebman, and Stephen E. Stein
Quantity | Value | Units | Method | Reference | Comment |
---|---|---|---|---|---|
ΔfH°solid | 565.4 ± 4.4 | kJ/mol | Ccb | McEwan and Rigg, 1951 | |
Quantity | Value | Units | Method | Reference | Comment |
ΔcH°solid | -1984.85 | kJ/mol | Ccb | Handrick, 1956 | |
ΔcH°solid | -1924.1 ± 4.4 | kJ/mol | Ccb | McEwan and Rigg, 1951 |

References

McEwan and Rigg, 1951
McEwan, W.S.; Rigg, M.W.,
The heats of combustion of compounds containing the tetrazole ring,
J. Am. Chem. Soc., 1951, 73, 4725-4727. [all data]
Handrick, 1956
Handrick, G.R.,
Report of the study of pure explosive compounds. Part IV. Calculation of heat of combustion of organic compounds from structural features and calculation of power of high explosives, Rpt. C-58247 for the Office of the Chief of Ordnance, contract DA-19-020-ORD-47 by the Arthur D. Little, Inc., Cambridge, MA, 1956, 467-573. [all data]