3-Tert-butylbenzoic acid
- Formula: C11H14O2
- Molecular weight: 178.2277
- IUPAC Standard InChIKey: PWEJHEZAHNQSHP-UHFFFAOYSA-N
- CAS Registry Number: 7498-54-6
- Chemical structure:
View 3d structure (requires JavaScript / HTML 5) - Permanent link for this species. Use this link for bookmarking this species for future reference.

Phase change data

Data compiled as indicated in comments:
DRB - Donald R. Burgess, Jr.
ALS - Hussein Y. Afeefy, Joel F. Liebman, and Stephen E. Stein
AC - William E. Acree, Jr., James S. Chickos
Quantity | Value | Units | Method | Reference | Comment |
---|---|---|---|---|---|
ΔsubH° | 24.74 | kcal/mol | N/A | Colomina, Jimenez, et al., 1979 | DRB |
Enthalpy of sublimation
ΔsubH (kcal/mol) | Temperature (K) | Method | Reference | Comment |
---|---|---|---|---|
24.74 ± 0.24 | 326.5 | V | Colomina, Jimenez, et al., 1979 | ALS |
24.6 ± 0.1 | 327. | ME | Colomina, Jimenez, et al., 1979 | Based on data from 318. to 335. K.; AC |

Gas phase ion energetics data

Data compiled by: John E. Bartmess
De-protonation reactions
C11H13O2- + =
By formula: C11H13O2- + H+ = C11H14O2
Quantity | Value | Units | Method | Reference | Comment |
---|---|---|---|---|---|
ΔrH° | 339.2 ± 2.2 | kcal/mol | G+TS | Kulhanek, Decouzon, et al., 1999 | gas phase |
Quantity | Value | Units | Method | Reference | Comment |
ΔrG° | 332.1 ± 2.0 | kcal/mol | IMRE | Kulhanek, Decouzon, et al., 1999 | gas phase |

Condensed phase thermochemistry data

Data compiled by: Hussein Y. Afeefy, Joel F. Liebman, and Stephen E. Stein
Quantity | Value | Units | Method | Reference | Comment |
---|---|---|---|---|---|
ΔfH°solid | -120.5 ± 0.38 | kcal/mol | Ccb | Colomina, Jimenez, et al., 1979 | |
Quantity | Value | Units | Method | Reference | Comment |
ΔcH°solid | -1392.23 ± 0.18 | kcal/mol | Ccb | Colomina, Jimenez, et al., 1979 | Corresponding ΔfHºsolid = -120.54 kcal/mol (simple calculation by NIST; no Washburn corrections) |

Gas phase thermochemistry data

Data compiled by: Hussein Y. Afeefy, Joel F. Liebman, and Stephen E. Stein
Quantity | Value | Units | Method | Reference | Comment |
---|---|---|---|---|---|
ΔfH°gas | -95.79 ± 0.45 | kcal/mol | Ccb | Colomina, Jimenez, et al., 1979 |

Reaction thermochemistry data

Data compiled by: John E. Bartmess

Individual Reactions

C11H13O2- + Hydrogen cation = 3-Tert-butylbenzoic acid

By formula: C11H13O2- + H+ = C11H14O2

Quantity Value Units Method Reference Comment
Δr1419. ± 9.2kJ/molG+TSKulhanek, Decouzon, et al., 1999gas phase
Quantity Value Units Method Reference Comment
Δr1390. ± 8.4kJ/molIMREKulhanek, Decouzon, et al., 1999gas phase

References

Colomina, Jimenez, et al., 1979
Colomina, M.; Jimenez, P.; Perez-Ossorio, R.; Turrion, C.,
Thermochemical properties of benzoic acid derivatives. VIII. Enthalpies of combustion and formation of o-, m-, and p-t-butylbenzoic acids,
J. Chem. Thermodyn., 1979, 11, 1179-1184. [all data]