1,1,1-Trimethoxy-2-chloroethane
- Formula: C5H11ClO3
- Molecular weight: 154.592
- IUPAC Standard InChIKey: NPEIUNVTLXEOLT-UHFFFAOYSA-N
- CAS Registry Number: 74974-54-2
- Chemical structure:
View 3d structure (requires JavaScript / HTML 5) - Permanent link for this species. Use this link for bookmarking this species for future reference.

Gas phase thermochemistry data

Data compiled by: Hussein Y. Afeefy, Joel F. Liebman, and Stephen E. Stein
Quantity | Value | Units | Method | Reference | Comment |
---|---|---|---|---|---|
ΔfH°gas | -614. ± 10. | kJ/mol | Eqk | Guthrie and Cullimore, 1980 | Using Hf(s,ClCH2COOH)=-122.0±2.0 kcal/mol |

Condensed phase thermochemistry data

Data compiled by: Hussein Y. Afeefy, Joel F. Liebman, and Stephen E. Stein
Quantity | Value | Units | Method | Reference | Comment |
---|---|---|---|---|---|
ΔfH°liquid | -661.1 ± 8.8 | kJ/mol | Eqk | Guthrie and Cullimore, 1980 | Using Hf(s,ClCH2COOH)=-122.0±2.0 kcal/mol |

Phase change data

Data compiled by: Hussein Y. Afeefy, Joel F. Liebman, and Stephen E. Stein
Quantity | Value | Units | Method | Reference | Comment |
---|---|---|---|---|---|
ΔvapH° | 47.5 ± 4.2 | kJ/mol | E | Guthrie and Cullimore, 1980 | Using Hf(s,ClCH2COOH)=-122.0±2.0 kcal/mol |

Reaction thermochemistry data

Data compiled by: Hussein Y. Afeefy, Joel F. Liebman, and Stephen E. Stein
Individual Reactions
By formula: C5H11ClO3 + H2O = 2CH4O + C3H5ClO2
Quantity | Value | Units | Method | Reference | Comment |
---|---|---|---|---|---|
ΔrH° | -32.6 ± 1.1 | kJ/mol | Eqk | Guthrie and Cullimore, 1980 | liquid phase; Using Hf(s,ClCH2COOH)=-122.0±2.0 kcal/mol |

References

Guthrie and Cullimore, 1980
Guthrie, J.P.; Cullimore, P.A.,
Effect of the acyl substituent on the equilibrium constant for hydration of esters,
Can. J. Chem., 1980, 58, 1281-1294. [all data]