Benzeneacetic acid, 3-phenyl-2-propenyl ester
- Formula: C17H16O2
- Molecular weight: 252.3077
- IUPAC Standard InChIKey: SFXQCOMMEMBETJ-KPKJPENVSA-N
- CAS Registry Number: 7492-65-1
- Chemical structure:
View 3d structure (requires JavaScript / HTML 5) - Other names: Benzeneacetic acid, 3-phenyl-2-propyl ester; Styrallyl phenylacetate; cinnamyl phenylacetate

Kovats' RI, non-polar column, isothermal

Column type | Active phase | Temperature (C) | I | Reference | Comment |
---|---|---|---|---|---|
Capillary | SE-30 | 180. | 1820. | Tudor and Moldovan, 1999 | |
Capillary | SE-30 | 200. | 1820.4 | Tudor, 1997 | 40. m/0.35 mm/0.35 μm |

References

Tudor and Moldovan, 1999
Tudor, E.; Moldovan, D.,
Temperature Dependence of the Retention Index for Perfumery Compounds on a Se-30 Glass Capillary Column. II. The Hyperbolic Equation,
J. Chromatogr., 1999, 848, 1-2, 215-227, https://doi.org/10.1016/S0021-9673(99)00412-4
. [all data]
Tudor, 1997
Tudor, E.,
Temperature dependence of the retention index for perfumery compounds on a SE-30 glass capillary column. I. Linear equations,
J. Chromatogr. A, 1997, 779, 1-2, 287-297, https://doi.org/10.1016/S0021-9673(97)00453-6
. [all data]